BDBM27360 7-(propan-2-yl)-2-(pyridin-4-yl)-1H,4H,5H,6H,7H-pyrrolo[3,2-c]pyridin-4-one::Pyrrolopyridinone, 79
SMILES: CC(C)C1CNC(=O)c2cc([nH]c12)-c1ccncc1
InChI Key: InChIKey=DAENWNUTCUORJB-UHFFFAOYSA-N
Data: 1 IC50
Activity Spreadsheet -- Enzyme Inhibition Constant Data from BindingDB
Found 1 hit for monomerid = 27360
Trg + Lig
Ki
nM
ΔG°
kcal/mole
IC50
nM
Kd
nM
EC50/IC50
nM
koff
s-1
kon
M-1s-1
pHTemp
°C
Cdc7 Kinase
(Homo sapiens (Human))
BDBM27360
(7-(propan-2-yl)-2-(pyridin-4-yl)-1H,4H,5H,6H,7H-py...)
Show SMILES CC(C)C1CNC(=O)c2cc([nH]c12)-c1ccncc1
Show InChI InChI=1S/C15H17N3O/c1-9(2)12-8-17-15(19)11-7-13(18-14(11)12)10-3-5-16-6-4-10/h3-7,9,12,18H,8H2,1-2H3,(H,17,19)
Reactome pathway
n/an/a 10n/an/an/an/a7.925
Nerviano Medical Sciences Srl
Assay Description
The potency of the compound toward kinase activity was determined using a Dowex resin-based assay. The substrate was phosphorylated by kinase in the ...
J Med Chem 52: 293-307 (2009)
Article DOI: 10.1021/jm800977q
BindingDB Entry DOI: 10.7270/Q27W69JX