BDBM27369 2-(2-aminopyrimidin-4-yl)-7-cyclobutyl-1H,4H,5H,6H,7H-pyrrolo[3,2-c]pyridin-4-one::Pyrrolopyridinone, 88
SMILES: Nc1nccc(n1)-c1cc2c([nH]1)C(CNC2=O)C1CCC1
InChI Key: InChIKey=RVVCPHMRJJSUNV-UHFFFAOYSA-N
Data: 1 IC50
Activity Spreadsheet -- Enzyme Inhibition Constant Data from BindingDB
Found 1 hit for monomerid = 27369
Trg + Lig
Ki
nM
ΔG°
kcal/mole
IC50
nM
Kd
nM
EC50/IC50
nM
koff
s-1
kon
M-1s-1
pHTemp
°C
Cdc7 Kinase
(Homo sapiens (Human))
BDBM27369
(2-(2-aminopyrimidin-4-yl)-7-cyclobutyl-1H,4H,5H,6H...)
Show SMILES Nc1nccc(n1)-c1cc2c([nH]1)C(CNC2=O)C1CCC1
Show InChI InChI=1S/C15H17N5O/c16-15-17-5-4-11(20-15)12-6-9-13(19-12)10(7-18-14(9)21)8-2-1-3-8/h4-6,8,10,19H,1-3,7H2,(H,18,21)(H2,16,17,20)
Reactome pathway
n/an/a 5n/an/an/an/a7.925
Nerviano Medical Sciences Srl
Assay Description
The potency of the compound toward kinase activity was determined using a Dowex resin-based assay. The substrate was phosphorylated by kinase in the ...
J Med Chem 52: 293-307 (2009)
Article DOI: 10.1021/jm800977q
BindingDB Entry DOI: 10.7270/Q27W69JX