BDBM2737 3,4-dihydroquinoxaline-2(1H)-thione derivative::HBY-097::propan-2-yl (2S)-7-methoxy-2-[(methylsulfanyl)methyl]-3-sulfanylidene-1,2,3,4-tetrahydroquinoxaline-1-carboxylate
SMILES: COc1ccc2NC(=S)[C@H](CSC)N(C(=O)OC(C)C)c2c1
InChI Key: InChIKey=GWKIPRVERALPRD-ZDUSSCGKSA-N
Data: 3 IC50
PDB links: 4 PDB IDs match this monomer.
Activity Spreadsheet -- Enzyme Inhibition Constant Data from BindingDB
Found 3 hits for monomerid = 2737
Trg + Lig
Ki
nM
ΔG°
kcal/mole
IC50
nM
Kd
nM
EC50/IC50
nM
koff
s-1
kon
M-1s-1
pHTemp
°C
HIV-1 Reverse Transcriptase
(Human immunodeficiency virus type 1)
BDBM2737
(3,4-dihydroquinoxaline-2(1H)-thione derivative | H...)
Show SMILES COc1ccc2NC(=S)[C@H](CSC)N(C(=O)OC(C)C)c2c1 |r|
Show InChI InChI=1S/C15H20N2O3S2/c1-9(2)20-15(18)17-12-7-10(19-3)5-6-11(12)16-14(21)13(17)8-22-4/h5-7,9,13H,8H2,1-4H3,(H,16,21)/t13-/m0/s1
n/an/a 8n/an/an/an/an/an/a
Medivir AB
Assay Description
The IC50 of reverse transcriptase is the concentration that inhibits 50% of recombinant HIV-1 RT RNA-directed DNA polymerase activity in vitro.
J Med Chem 42: 4150-60 (1999)
Article DOI: 10.1021/jm990095j
BindingDB Entry DOI: 10.7270/Q25X273G
3D
3D Structure (crystal)
HIV-1 Reverse Transcriptase Mutant (K103N)
(Human immunodeficiency virus type 1)
BDBM2737
(3,4-dihydroquinoxaline-2(1H)-thione derivative | H...)
Show SMILES COc1ccc2NC(=S)[C@H](CSC)N(C(=O)OC(C)C)c2c1 |r|
Show InChI InChI=1S/C15H20N2O3S2/c1-9(2)20-15(18)17-12-7-10(19-3)5-6-11(12)16-14(21)13(17)8-22-4/h5-7,9,13H,8H2,1-4H3,(H,16,21)/t13-/m0/s1
n/an/a 56n/an/an/an/an/an/a
Medivir AB
Assay Description
The IC50 of reverse transcriptase is the concentration that inhibits 50% of recombinant HIV-1 RT RNA-directed DNA polymerase activity in vitro.
J Med Chem 42: 4150-60 (1999)
Article DOI: 10.1021/jm990095j
BindingDB Entry DOI: 10.7270/Q25X273G
3D
3D Structure (crystal)
HIV-1 Reverse Transcriptase Mutant (Y181C)
(Human immunodeficiency virus type 1)
BDBM2737
(3,4-dihydroquinoxaline-2(1H)-thione derivative | H...)
Show SMILES COc1ccc2NC(=S)[C@H](CSC)N(C(=O)OC(C)C)c2c1 |r|
Show InChI InChI=1S/C15H20N2O3S2/c1-9(2)20-15(18)17-12-7-10(19-3)5-6-11(12)16-14(21)13(17)8-22-4/h5-7,9,13H,8H2,1-4H3,(H,16,21)/t13-/m0/s1
n/an/a 9n/an/an/an/an/an/a
Medivir AB
Assay Description
The IC50 of reverse transcriptase is the concentration that inhibits 50% of recombinant HIV-1 RT RNA-directed DNA polymerase activity in vitro.
J Med Chem 42: 4150-60 (1999)
Article DOI: 10.1021/jm990095j
BindingDB Entry DOI: 10.7270/Q25X273G
3D
3D Structure (crystal)