BDBM27370 2-(2-aminopyrimidin-4-yl)-7-(2-fluoroethyl)-1H,4H,5H,6H,7H-pyrrolo[3,2-c]pyridin-4-one::Pyrrolopyridinone, 89
SMILES: Nc1nccc(n1)-c1cc2c([nH]1)C(CCF)CNC2=O
InChI Key: InChIKey=LCBAQTCTQXHTJG-UHFFFAOYSA-N
Data: 1 IC50
PDB links: 1 PDB ID matches this monomer.
Activity Spreadsheet -- Enzyme Inhibition Constant Data from BindingDB
Found 1 hit for monomerid = 27370
Trg + Lig
Ki
nM
ΔG°
kcal/mole
IC50
nM
Kd
nM
EC50/IC50
nM
koff
s-1
kon
M-1s-1
pHTemp
°C
Cdc7 Kinase
(Homo sapiens (Human))
BDBM27370
(2-(2-aminopyrimidin-4-yl)-7-(2-fluoroethyl)-1H,4H,...)
Show SMILES Nc1nccc(n1)-c1cc2c([nH]1)C(CCF)CNC2=O
Show InChI InChI=1S/C13H14FN5O/c14-3-1-7-6-17-12(20)8-5-10(18-11(7)8)9-2-4-16-13(15)19-9/h2,4-5,7,18H,1,3,6H2,(H,17,20)(H2,15,16,19)
Reactome pathway
n/an/a 3n/an/an/an/a7.925
Nerviano Medical Sciences Srl
Assay Description
The potency of the compound toward kinase activity was determined using a Dowex resin-based assay. The substrate was phosphorylated by kinase in the ...
J Med Chem 52: 293-307 (2009)
Article DOI: 10.1021/jm800977q
BindingDB Entry DOI: 10.7270/Q27W69JX