BDBM27372 2-(2-aminopyrimidin-4-yl)-7,7-diethyl-1H,4H,5H,6H,7H-pyrrolo[3,2-c]pyridin-4-one::Pyrrolopyridinone, 91
SMILES: CCC1(CC)CNC(=O)c2cc([nH]c12)-c1ccnc(N)n1
InChI Key: InChIKey=FOTRQUZIJMKFFQ-UHFFFAOYSA-N
Data: 1 IC50
Activity Spreadsheet -- Enzyme Inhibition Constant Data from BindingDB
Found 1 hit for monomerid = 27372
Trg + Lig
Ki
nM
ΔG°
kcal/mole
IC50
nM
Kd
nM
EC50/IC50
nM
koff
s-1
kon
M-1s-1
pHTemp
°C
Cdc7 Kinase
(Homo sapiens (Human))
BDBM27372
(2-(2-aminopyrimidin-4-yl)-7,7-diethyl-1H,4H,5H,6H,...)
Show SMILES CCC1(CC)CNC(=O)c2cc([nH]c12)-c1ccnc(N)n1
Show InChI InChI=1S/C15H19N5O/c1-3-15(4-2)8-18-13(21)9-7-11(19-12(9)15)10-5-6-17-14(16)20-10/h5-7,19H,3-4,8H2,1-2H3,(H,18,21)(H2,16,17,20)
Reactome pathway
n/an/a 5n/an/an/an/a7.925
Nerviano Medical Sciences Srl
Assay Description
The potency of the compound toward kinase activity was determined using a Dowex resin-based assay. The substrate was phosphorylated by kinase in the ...
J Med Chem 52: 293-307 (2009)
Article DOI: 10.1021/jm800977q
BindingDB Entry DOI: 10.7270/Q27W69JX