BDBM273782 US10071079, Example 568::US10071079, Example 569::US10478424, Example 569
SMILES: COc1cc(cn2ncnc12)-c1[nH]c2ccc(cc2c1C(C)C)C1CCN(CC1)C1CCOC1
InChI Key:
Data: 12 IC50
Activity Spreadsheet -- Enzyme Inhibition Constant Data from BindingDB
Found 12 hits for monomerid = 273782
Trg + Lig
Ki
nM
ΔG°
kcal/mole
IC50
nM
Kd
nM
EC50/IC50
nM
koff
s-1
kon
M-1s-1
pHTemp
°C
Toll-like receptor 7
(Homo sapiens (Human))
BDBM273782
(US10071079, Example 568 | US10071079, Example 569 ...)
Show SMILES COc1cc(cn2ncnc12)-c1[nH]c2ccc(cc2c1C(C)C)C1CCN(CC1)C1CCOC1
US Patent
n/an/a 0.700n/an/an/an/an/a25
Bristol-Myers Squibb Company
US Patent
Assay Description
HEK-Blue-cells (Invivogen) overexpressing human TLR7, TLR8 or TLR9 receptors were used for screening inhibitors of these receptors using an inducible...
US Patent US10071079 (2018)
BindingDB Entry DOI: 10.7270/Q2VD71GV
Toll-like receptor 8
(Homo sapiens (Human))
BDBM273782
(US10071079, Example 568 | US10071079, Example 569 ...)
Show SMILES COc1cc(cn2ncnc12)-c1[nH]c2ccc(cc2c1C(C)C)C1CCN(CC1)C1CCOC1
US Patent
n/an/a 1.80n/an/an/an/an/a25
Bristol-Myers Squibb Company
US Patent
Assay Description
HEK-Blue-cells (Invivogen) overexpressing human TLR7, TLR8 or TLR9 receptors were used for screening inhibitors of these receptors using an inducible...
US Patent US10071079 (2018)
BindingDB Entry DOI: 10.7270/Q2VD71GV
Toll-like receptor 9
(Homo sapiens (Human))
BDBM273782
(US10071079, Example 568 | US10071079, Example 569 ...)
Show SMILES COc1cc(cn2ncnc12)-c1[nH]c2ccc(cc2c1C(C)C)C1CCN(CC1)C1CCOC1
US Patent
n/an/a 1.45E+3n/an/an/an/an/a25
Bristol-Myers Squibb Company
US Patent
Assay Description
HEK-Blue-cells (Invivogen) overexpressing human TLR7, TLR8 or TLR9 receptors were used for screening inhibitors of these receptors using an inducible...
US Patent US10071079 (2018)
BindingDB Entry DOI: 10.7270/Q2VD71GV
Toll-like receptor 7
(Homo sapiens (Human))
BDBM273782
(US10071079, Example 568 | US10071079, Example 569 ...)
Show SMILES COc1cc(cn2ncnc12)-c1[nH]c2ccc(cc2c1C(C)C)C1CCN(CC1)C1CCOC1
US Patent
n/an/a 0.400n/an/an/an/an/a25
Bristol-Myers Squibb Company
US Patent
Assay Description
HEK-Blue-cells (Invivogen) overexpressing human TLR7, TLR8 or TLR9 receptors were used for screening inhibitors of these receptors using an inducible...
US Patent US10071079 (2018)
BindingDB Entry DOI: 10.7270/Q2VD71GV
Toll-like receptor 8
(Homo sapiens (Human))
BDBM273782
(US10071079, Example 568 | US10071079, Example 569 ...)
Show SMILES COc1cc(cn2ncnc12)-c1[nH]c2ccc(cc2c1C(C)C)C1CCN(CC1)C1CCOC1
US Patent
n/an/a 1.30n/an/an/an/an/a25
Bristol-Myers Squibb Company
US Patent
Assay Description
HEK-Blue-cells (Invivogen) overexpressing human TLR7, TLR8 or TLR9 receptors were used for screening inhibitors of these receptors using an inducible...
US Patent US10071079 (2018)
BindingDB Entry DOI: 10.7270/Q2VD71GV
Toll-like receptor 9
(Homo sapiens (Human))
BDBM273782
(US10071079, Example 568 | US10071079, Example 569 ...)
Show SMILES COc1cc(cn2ncnc12)-c1[nH]c2ccc(cc2c1C(C)C)C1CCN(CC1)C1CCOC1
US Patent
n/an/a 1.57E+3n/an/an/an/an/an/a
Bristol-Myers Squibb Company
US Patent
Assay Description
HEK-Blue-cells (Invivogen) overexpressing human TLR7, TLR8 or TLR9 receptors were used for screening inhibitors of these receptors using an inducible...
US Patent US10478424 (2019)
BindingDB Entry DOI: 10.7270/Q2QZ2DB0
Toll-like receptor 7
(Homo sapiens (Human))
BDBM273782
(US10071079, Example 568 | US10071079, Example 569 ...)
Show SMILES COc1cc(cn2ncnc12)-c1[nH]c2ccc(cc2c1C(C)C)C1CCN(CC1)C1CCOC1
US Patent
n/an/a 0.700n/an/an/an/an/an/a
Bristol-Myers Squibb Company
US Patent
Assay Description
HEK-Blue-cells (Invivogen) overexpressing human TLR7, TLR8 or TLR9 receptors were used for screening inhibitors of these receptors using an inducible...
US Patent US10478424 (2019)
BindingDB Entry DOI: 10.7270/Q2QZ2DB0
Toll-like receptor 8
(Homo sapiens (Human))
BDBM273782
(US10071079, Example 568 | US10071079, Example 569 ...)
Show SMILES COc1cc(cn2ncnc12)-c1[nH]c2ccc(cc2c1C(C)C)C1CCN(CC1)C1CCOC1
US Patent
n/an/a 1.80n/an/an/an/an/an/a
Bristol-Myers Squibb Company
US Patent
Assay Description
HEK-Blue-cells (Invivogen) overexpressing human TLR7, TLR8 or TLR9 receptors were used for screening inhibitors of these receptors using an inducible...
US Patent US10478424 (2019)
BindingDB Entry DOI: 10.7270/Q2QZ2DB0
Toll-like receptor 9
(Homo sapiens (Human))
BDBM273782
(US10071079, Example 568 | US10071079, Example 569 ...)
Show SMILES COc1cc(cn2ncnc12)-c1[nH]c2ccc(cc2c1C(C)C)C1CCN(CC1)C1CCOC1
US Patent
n/an/a 1.45E+3n/an/an/an/an/an/a
Bristol-Myers Squibb Company
US Patent
Assay Description
HEK-Blue-cells (Invivogen) overexpressing human TLR7, TLR8 or TLR9 receptors were used for screening inhibitors of these receptors using an inducible...
US Patent US10478424 (2019)
BindingDB Entry DOI: 10.7270/Q2QZ2DB0
Toll-like receptor 7
(Homo sapiens (Human))
BDBM273782
(US10071079, Example 568 | US10071079, Example 569 ...)
Show SMILES COc1cc(cn2ncnc12)-c1[nH]c2ccc(cc2c1C(C)C)C1CCN(CC1)C1CCOC1
US Patent
n/an/a 0.400n/an/an/an/an/an/a
Bristol-Myers Squibb Company
US Patent
Assay Description
HEK-Blue-cells (Invivogen) overexpressing human TLR7, TLR8 or TLR9 receptors were used for screening inhibitors of these receptors using an inducible...
US Patent US10478424 (2019)
BindingDB Entry DOI: 10.7270/Q2QZ2DB0
Toll-like receptor 8
(Homo sapiens (Human))
BDBM273782
(US10071079, Example 568 | US10071079, Example 569 ...)
Show SMILES COc1cc(cn2ncnc12)-c1[nH]c2ccc(cc2c1C(C)C)C1CCN(CC1)C1CCOC1
US Patent
n/an/a 1.30n/an/an/an/an/an/a
Bristol-Myers Squibb Company
US Patent
Assay Description
HEK-Blue-cells (Invivogen) overexpressing human TLR7, TLR8 or TLR9 receptors were used for screening inhibitors of these receptors using an inducible...
US Patent US10478424 (2019)
BindingDB Entry DOI: 10.7270/Q2QZ2DB0
Toll-like receptor 9
(Homo sapiens (Human))
BDBM273782
(US10071079, Example 568 | US10071079, Example 569 ...)
Show SMILES COc1cc(cn2ncnc12)-c1[nH]c2ccc(cc2c1C(C)C)C1CCN(CC1)C1CCOC1
US Patent
n/an/a 1.57E+3n/an/an/an/an/a25
Bristol-Myers Squibb Company
US Patent
Assay Description
HEK-Blue-cells (Invivogen) overexpressing human TLR7, TLR8 or TLR9 receptors were used for screening inhibitors of these receptors using an inducible...
US Patent US10071079 (2018)
BindingDB Entry DOI: 10.7270/Q2VD71GV