BDBM27387 1H,4H,5H,6H,7H-pyrrolo[3,2-c]pyridin-4-one::pyrrolopyridinone scaffold, 9
SMILES: O=C1NCCc2[nH]ccc12
InChI Key: InChIKey=WOELPIAAQNOJDS-UHFFFAOYSA-N
Data: 1 IC50
PDB links: 4 PDB IDs contain this monomer as substructures. 4 PDB IDs contain inhibitors having a similarity of 90% to this monomer.
Activity Spreadsheet -- Enzyme Inhibition Constant Data from BindingDB
Found 1 hit for monomerid = 27387
Trg + Lig
Ki
nM
ΔG°
kcal/mole
IC50
nM
Kd
nM
EC50/IC50
nM
koff
s-1
kon
M-1s-1
pHTemp
°C
Cdc7 Kinase
(Homo sapiens (Human))
BDBM27387
(1H,4H,5H,6H,7H-pyrrolo[3,2-c]pyridin-4-one | pyrro...)
Show SMILES O=C1NCCc2[nH]ccc12
Show InChI InChI=1S/C7H8N2O/c10-7-5-1-3-8-6(5)2-4-9-7/h1,3,8H,2,4H2,(H,9,10)
Reactome pathway
n/an/a>5.00E+3n/an/an/an/a7.925
Nerviano Medical Sciences Srl
Assay Description
The potency of the compound toward kinase activity was determined using a Dowex resin-based assay. The substrate was phosphorylated by kinase in the ...
J Med Chem 51: 487-501 (2008)
Article DOI: 10.1021/jm700956r
BindingDB Entry DOI: 10.7270/Q247485B