BDBM27395 2-(pyridin-4-yl)-4H,5H,6H,7H-pyrazolo[1,5-a]pyrazin-4-one::pyrrolopyridinone scaffold, 17
SMILES: O=C1NCCn2nc(cc12)-c1ccncc1
InChI Key: InChIKey=WLPCGGLGZLZZLW-UHFFFAOYSA-N
Data: 1 IC50
Activity Spreadsheet -- Enzyme Inhibition Constant Data from BindingDB
Found 1 hit for monomerid = 27395
Trg + Lig
Ki
nM
ΔG°
kcal/mole
IC50
nM
Kd
nM
EC50/IC50
nM
koff
s-1
kon
M-1s-1
pHTemp
°C
Cdc7 Kinase
(Homo sapiens (Human))
BDBM27395
(2-(pyridin-4-yl)-4H,5H,6H,7H-pyrazolo[1,5-a]pyrazi...)
Show SMILES O=C1NCCn2nc(cc12)-c1ccncc1
Show InChI InChI=1S/C11H10N4O/c16-11-10-7-9(8-1-3-12-4-2-8)14-15(10)6-5-13-11/h1-4,7H,5-6H2,(H,13,16)
Reactome pathway
n/an/a 210n/an/an/an/a7.925
Nerviano Medical Sciences Srl
Assay Description
The potency of the compound toward kinase activity was determined using a Dowex resin-based assay. The substrate was phosphorylated by kinase in the ...
J Med Chem 51: 487-501 (2008)
Article DOI: 10.1021/jm700956r
BindingDB Entry DOI: 10.7270/Q247485B