BDBM27397 2-(pyridin-4-yl)-1H,4H,5H,6H-pyrrolo[2,3-c]pyrrol-4-one::pyrrolopyridinone scaffold, 19
SMILES: O=C1NCc2[nH]c(cc12)-c1ccncc1
InChI Key: InChIKey=VNHCUITWGVMRGF-UHFFFAOYSA-N
Data: 1 IC50
Activity Spreadsheet -- Enzyme Inhibition Constant Data from BindingDB
Found 1 hit for monomerid = 27397
Trg + Lig
Ki
nM
ΔG°
kcal/mole
IC50
nM
Kd
nM
EC50/IC50
nM
koff
s-1
kon
M-1s-1
pHTemp
°C
Cdc7 Kinase
(Homo sapiens (Human))
BDBM27397
(2-(pyridin-4-yl)-1H,4H,5H,6H-pyrrolo[2,3-c]pyrrol-...)
Show SMILES O=C1NCc2[nH]c(cc12)-c1ccncc1
Show InChI InChI=1S/C11H9N3O/c15-11-8-5-9(14-10(8)6-13-11)7-1-3-12-4-2-7/h1-5,14H,6H2,(H,13,15)
Reactome pathway
n/an/a 27n/an/an/an/a7.925
Nerviano Medical Sciences Srl
Assay Description
The potency of the compound toward kinase activity was determined using a Dowex resin-based assay. The substrate was phosphorylated by kinase in the ...
J Med Chem 51: 487-501 (2008)
Article DOI: 10.1021/jm700956r
BindingDB Entry DOI: 10.7270/Q247485B