BDBM273991 US10071079, Example 777
SMILES: CC(N)N(C)CC(=O)N1CCC(CC1)c1ccc2[nH]c(c(C(C)C)c2c1)-c1cc(c2ncnn2c1)C(F)(F)F
InChI Key:
Data: 3 IC50
Activity Spreadsheet -- Enzyme Inhibition Constant Data from BindingDB
Found 3 hits for monomerid = 273991
Trg + Lig
Ki
nM
ΔG°
kcal/mole
IC50
nM
Kd
nM
EC50/IC50
nM
koff
s-1
kon
M-1s-1
pHTemp
°C
Toll-like receptor 7
(Homo sapiens (Human))
BDBM273991
(US10071079, Example 777)
Show SMILES CC(N)N(C)CC(=O)N1CCC(CC1)c1ccc2[nH]c(c(C(C)C)c2c1)-c1cc(c2ncnn2c1)C(F)(F)F
US Patent
n/an/a 0.400n/an/an/an/an/a25
Bristol-Myers Squibb Company
US Patent
Assay Description
HEK-Blue-cells (Invivogen) overexpressing human TLR7, TLR8 or TLR9 receptors were used for screening inhibitors of these receptors using an inducible...
US Patent US10071079 (2018)
BindingDB Entry DOI: 10.7270/Q2VD71GV
Toll-like receptor 9
(Homo sapiens (Human))
BDBM273991
(US10071079, Example 777)
Show SMILES CC(N)N(C)CC(=O)N1CCC(CC1)c1ccc2[nH]c(c(C(C)C)c2c1)-c1cc(c2ncnn2c1)C(F)(F)F
US Patent
n/an/a 4.97E+3n/an/an/an/an/a25
Bristol-Myers Squibb Company
US Patent
Assay Description
HEK-Blue-cells (Invivogen) overexpressing human TLR7, TLR8 or TLR9 receptors were used for screening inhibitors of these receptors using an inducible...
US Patent US10071079 (2018)
BindingDB Entry DOI: 10.7270/Q2VD71GV
Toll-like receptor 8
(Homo sapiens (Human))
BDBM273991
(US10071079, Example 777)
Show SMILES CC(N)N(C)CC(=O)N1CCC(CC1)c1ccc2[nH]c(c(C(C)C)c2c1)-c1cc(c2ncnn2c1)C(F)(F)F
US Patent
n/an/a 22.6n/an/an/an/an/a25
Bristol-Myers Squibb Company
US Patent
Assay Description
HEK-Blue-cells (Invivogen) overexpressing human TLR7, TLR8 or TLR9 receptors were used for screening inhibitors of these receptors using an inducible...
US Patent US10071079 (2018)
BindingDB Entry DOI: 10.7270/Q2VD71GV