BDBM27407 2-(2-aminopyrimidin-4-yl)-1-propyl-1H,4H,5H,6H,7H-pyrrolo[3,2-c]pyridin-4-one::pyrrolopyridinone scaffold, 29
SMILES: CCCn1c2CCNC(=O)c2cc1-c1ccnc(N)n1
InChI Key: InChIKey=DUMFZPABXQMXDF-UHFFFAOYSA-N
Data: 1 IC50
Activity Spreadsheet -- Enzyme Inhibition Constant Data from BindingDB
Found 1 hit for monomerid = 27407
Trg + Lig
Ki
nM
ΔG°
kcal/mole
IC50
nM
Kd
nM
EC50/IC50
nM
koff
s-1
kon
M-1s-1
pHTemp
°C
Cdc7 Kinase
(Homo sapiens (Human))
BDBM27407
(2-(2-aminopyrimidin-4-yl)-1-propyl-1H,4H,5H,6H,7H-...)
Show SMILES CCCn1c2CCNC(=O)c2cc1-c1ccnc(N)n1
Show InChI InChI=1S/C14H17N5O/c1-2-7-19-11-4-6-16-13(20)9(11)8-12(19)10-3-5-17-14(15)18-10/h3,5,8H,2,4,6-7H2,1H3,(H,16,20)(H2,15,17,18)
Reactome pathway
n/an/a 12n/an/an/an/a7.925
Nerviano Medical Sciences Srl
Assay Description
The potency of the compound toward kinase activity was determined using a Dowex resin-based assay. The substrate was phosphorylated by kinase in the ...
J Med Chem 51: 487-501 (2008)
Article DOI: 10.1021/jm700956r
BindingDB Entry DOI: 10.7270/Q247485B