BDBM27413 2-(2-aminopyrimidin-4-yl)-1-(2-fluoroethyl)-1H,4H,5H,6H,7H-pyrrolo[3,2-c]pyridin-4-one::pyrrolopyridinone scaffold, 35
SMILES: Nc1nccc(n1)-c1cc2c(CCNC2=O)n1CCF
InChI Key: InChIKey=AOWKJWLAHRQUIW-UHFFFAOYSA-N
Data: 1 IC50
Activity Spreadsheet -- Enzyme Inhibition Constant Data from BindingDB
Found 1 hit for monomerid = 27413
Trg + Lig
Ki
nM
ΔG°
kcal/mole
IC50
nM
Kd
nM
EC50/IC50
nM
koff
s-1
kon
M-1s-1
pHTemp
°C
Cdc7 Kinase
(Homo sapiens (Human))
BDBM27413
(2-(2-aminopyrimidin-4-yl)-1-(2-fluoroethyl)-1H,4H,...)
Show SMILES Nc1nccc(n1)-c1cc2c(CCNC2=O)n1CCF
Show InChI InChI=1S/C13H14FN5O/c14-3-6-19-10-2-5-16-12(20)8(10)7-11(19)9-1-4-17-13(15)18-9/h1,4,7H,2-3,5-6H2,(H,16,20)(H2,15,17,18)
Reactome pathway
n/an/a 3n/an/an/an/an/an/a
Nerviano Medical Sciences Srl
Assay Description
The potency of the compound toward kinase activity was determined using a Dowex resin-based assay. The substrate was phosphorylated by kinase in the ...
J Med Chem 51: 487-501 (2008)
Article DOI: 10.1021/jm700956r
BindingDB Entry DOI: 10.7270/Q247485B