BDBM274471 N-(6-(1-(1-(2-aminoacetyl)piperidin-4- yl)-4-(4-fluorophenyl)-1H-imidazol-5- yl)imidazo[1,2-b]pyridazin-2-yl)-2- fluoroisonicotinamide::US9556179, Compound 40
SMILES: NCC(=O)N1CCC(CC1)n1cnc(c1-c1ccc2nc(NC(=O)c3ccnc(F)c3)cn2n1)-c1ccc(F)cc1
InChI Key: InChIKey=PVRCGKXHMDVICS-UHFFFAOYSA-N
Data: 2 IC50
Activity Spreadsheet -- Enzyme Inhibition Constant Data from BindingDB
Found 2 hits for monomerid = 274471
Trg + Lig
Ki
nM
ΔG°
kcal/mole
IC50
nM
Kd
nM
EC50/IC50
nM
koff
s-1
kon
M-1s-1
pHTemp
°C
Casein kinase I isoform delta
(Homo sapiens (Human))
BDBM274471
(N-(6-(1-(1-(2-aminoacetyl)piperidin-4- yl)-4-(4-fl...)
Show SMILES NCC(=O)N1CCC(CC1)n1cnc(c1-c1ccc2nc(NC(=O)c3ccnc(F)c3)cn2n1)-c1ccc(F)cc1
Show InChI InChI=1S/C28H25F2N9O2/c29-19-3-1-17(2-4-19)26-27(38(16-33-26)20-8-11-37(12-9-20)25(40)14-31)21-5-6-24-34-23(15-39(24)36-21)35-28(41)18-7-10-32-22(30)13-18/h1-7,10,13,15-16,20H,8-9,11-12,14,31H2,(H,35,41)
US Patent
n/an/a 0.0850n/an/an/an/a7.425
Bristol-Myers Squibb Company
US Patent
Assay Description
The kinase assay was performed in V-bottom 384-well plates. The final assay volume was 30 μl prepared from 15 μl additions of enzyme, subst...
US Patent US9556179 (2017)
BindingDB Entry DOI: 10.7270/Q2G73GR5
Casein kinase I isoform epsilon
(Homo sapiens (Human))
BDBM274471
(N-(6-(1-(1-(2-aminoacetyl)piperidin-4- yl)-4-(4-fl...)
Show SMILES NCC(=O)N1CCC(CC1)n1cnc(c1-c1ccc2nc(NC(=O)c3ccnc(F)c3)cn2n1)-c1ccc(F)cc1
Show InChI InChI=1S/C28H25F2N9O2/c29-19-3-1-17(2-4-19)26-27(38(16-33-26)20-8-11-37(12-9-20)25(40)14-31)21-5-6-24-34-23(15-39(24)36-21)35-28(41)18-7-10-32-22(30)13-18/h1-7,10,13,15-16,20H,8-9,11-12,14,31H2,(H,35,41)
US Patent
n/an/a 0.984n/an/an/an/a7.425
Bristol-Myers Squibb Company
US Patent
Assay Description
The kinase assay was performed in V-bottom 384-well plates. The final assay volume was 30 μl prepared from 15 μl additions of enzyme, subst...
US Patent US9556179 (2017)
BindingDB Entry DOI: 10.7270/Q2G73GR5