BDBM274493 2-fluoro-N-(6-(4-(4-fluorophenyl)-1-(1- (5-methylisoxazole-4- carbonyl)piperidin-4-yl)-1H-imidazol-5- yl)imidazo[1,2-b]pyridazin-2- yl)isonicotinamide::US9556179, Compound 62
SMILES: Cc1oncc1C(=O)N1CCC(CC1)n1cnc(c1-c1ccc2nc(NC(=O)c3ccnc(F)c3)cn2n1)-c1ccc(F)cc1
InChI Key: InChIKey=WCKCWZMNZNTEQL-UHFFFAOYSA-N
Data: 2 IC50
Activity Spreadsheet -- Enzyme Inhibition Constant Data from BindingDB
Found 2 hits for monomerid = 274493
Trg + Lig
Ki
nM
ΔG°
kcal/mole
IC50
nM
Kd
nM
EC50/IC50
nM
koff
s-1
kon
M-1s-1
pHTemp
°C
Casein kinase I isoform delta
(Homo sapiens (Human))
BDBM274493
(2-fluoro-N-(6-(4-(4-fluorophenyl)-1-(1- (5-methyli...)
Show SMILES Cc1oncc1C(=O)N1CCC(CC1)n1cnc(c1-c1ccc2nc(NC(=O)c3ccnc(F)c3)cn2n1)-c1ccc(F)cc1
Show InChI InChI=1S/C31H25F2N9O3/c1-18-23(15-36-45-18)31(44)40-12-9-22(10-13-40)41-17-35-28(19-2-4-21(32)5-3-19)29(41)24-6-7-27-37-26(16-42(27)39-24)38-30(43)20-8-11-34-25(33)14-20/h2-8,11,14-17,22H,9-10,12-13H2,1H3,(H,38,43)
US Patent
n/an/a 0.313n/an/an/an/a7.425
Bristol-Myers Squibb Company
US Patent
Assay Description
The kinase assay was performed in V-bottom 384-well plates. The final assay volume was 30 μl prepared from 15 μl additions of enzyme, subst...
US Patent US9556179 (2017)
BindingDB Entry DOI: 10.7270/Q2G73GR5
Casein kinase I isoform epsilon
(Homo sapiens (Human))
BDBM274493
(2-fluoro-N-(6-(4-(4-fluorophenyl)-1-(1- (5-methyli...)
Show SMILES Cc1oncc1C(=O)N1CCC(CC1)n1cnc(c1-c1ccc2nc(NC(=O)c3ccnc(F)c3)cn2n1)-c1ccc(F)cc1
Show InChI InChI=1S/C31H25F2N9O3/c1-18-23(15-36-45-18)31(44)40-12-9-22(10-13-40)41-17-35-28(19-2-4-21(32)5-3-19)29(41)24-6-7-27-37-26(16-42(27)39-24)38-30(43)20-8-11-34-25(33)14-20/h2-8,11,14-17,22H,9-10,12-13H2,1H3,(H,38,43)
US Patent
n/an/a 0.256n/an/an/an/a7.425
Bristol-Myers Squibb Company
US Patent
Assay Description
The kinase assay was performed in V-bottom 384-well plates. The final assay volume was 30 μl prepared from 15 μl additions of enzyme, subst...
US Patent US9556179 (2017)
BindingDB Entry DOI: 10.7270/Q2G73GR5