BDBM27467 2-amino-5-(4-chlorophenyl)-3-(4-sulfamoylphenyl)benzamide::Amino-substituted diarylbenzamide, 8h
SMILES: NC(=O)c1cc(cc(c1N)-c1ccc(cc1)S(N)(=O)=O)-c1ccc(Cl)cc1
InChI Key: InChIKey=XJLFMRGTLRIXDT-UHFFFAOYSA-N
Data: 3 IC50
Activity Spreadsheet -- Enzyme Inhibition Constant Data from BindingDB
Found 3 hits for monomerid = 27467
Trg + Lig
Ki
nM
ΔG°
kcal/mole
IC50
nM
Kd
nM
EC50/IC50
nM
koff
s-1
kon
M-1s-1
pHTemp
°C
Inhibitor of nuclear factor kappa-B kinase subunit alpha
(Homo sapiens (Human))
BDBM27467
(2-amino-5-(4-chlorophenyl)-3-(4-sulfamoylphenyl)be...)
Show SMILES NC(=O)c1cc(cc(c1N)-c1ccc(cc1)S(N)(=O)=O)-c1ccc(Cl)cc1
Show InChI InChI=1S/C19H16ClN3O3S/c20-14-5-1-11(2-6-14)13-9-16(18(21)17(10-13)19(22)24)12-3-7-15(8-4-12)27(23,25)26/h1-10H,21H2,(H2,22,24)(H2,23,25,26)
Reactome pathway
n/an/a 398n/an/an/an/a7.422
GSK
Assay Description
IKK kinase activity was assessed using a time-resolved fluorescence resonance energy transfer (TR-FRET) assay. The reaction was initiated by the addi...
Bioorg Med Chem Lett 17: 3972-7 (2007)
Article DOI: 10.1016/j.bmcl.2007.04.088
BindingDB Entry DOI: 10.7270/Q2QZ289W
Inhibitor of nuclear factor kappa-B kinase subunit epsilon
(Homo sapiens (Human))
BDBM27467
(2-amino-5-(4-chlorophenyl)-3-(4-sulfamoylphenyl)be...)
Show SMILES NC(=O)c1cc(cc(c1N)-c1ccc(cc1)S(N)(=O)=O)-c1ccc(Cl)cc1
Show InChI InChI=1S/C19H16ClN3O3S/c20-14-5-1-11(2-6-14)13-9-16(18(21)17(10-13)19(22)24)12-3-7-15(8-4-12)27(23,25)26/h1-10H,21H2,(H2,22,24)(H2,23,25,26)
Reactome pathway
n/an/a>1.58E+4n/an/an/an/an/an/a
GSK
Assay Description
IKK kinase activity was assessed using a time-resolved fluorescence resonance energy transfer (TR-FRET) assay. The reaction was initiated by the addi...
Bioorg Med Chem Lett 17: 3972-7 (2007)
Article DOI: 10.1016/j.bmcl.2007.04.088
BindingDB Entry DOI: 10.7270/Q2QZ289W
Inhibitor of nuclear factor kappa-B kinase subunit beta
(Homo sapiens (Human))
BDBM27467
(2-amino-5-(4-chlorophenyl)-3-(4-sulfamoylphenyl)be...)
Show SMILES NC(=O)c1cc(cc(c1N)-c1ccc(cc1)S(N)(=O)=O)-c1ccc(Cl)cc1
Show InChI InChI=1S/C19H16ClN3O3S/c20-14-5-1-11(2-6-14)13-9-16(18(21)17(10-13)19(22)24)12-3-7-15(8-4-12)27(23,25)26/h1-10H,21H2,(H2,22,24)(H2,23,25,26)
NCI pathway
Reactome pathway
n/an/a 100n/an/an/an/an/an/a
GSK
Assay Description
IKK kinase activity was assessed using a time-resolved fluorescence resonance energy transfer (TR-FRET) assay. The reaction was initiated by the addi...
Bioorg Med Chem Lett 17: 3972-7 (2007)
Article DOI: 10.1016/j.bmcl.2007.04.088
BindingDB Entry DOI: 10.7270/Q2QZ289W