BDBM27535 4-[(4-fluoro-3-{[4-(2-hydroxyethyl)-1,4-diazepan-1-yl]carbonyl}phenyl)methyl]-1,2-dihydrophthalazin-1-one::Homopiperazine analogue, 16
SMILES: OCCN1CCCN(CC1)C(=O)c1cc(Cc2n[nH]c(=O)c3ccccc23)ccc1F
InChI Key: InChIKey=DRIHFTMAXLFLFW-UHFFFAOYSA-N
Data: 1 IC50
Activity Spreadsheet -- Enzyme Inhibition Constant Data from BindingDB
Found 1 hit for monomerid = 27535
Trg + Lig
Ki
nM
ΔG°
kcal/mole
IC50
nM
Kd
nM
EC50/IC50
nM
koff
s-1
kon
M-1s-1
pHTemp
°C
Poly [ADP-ribose] polymerase 1
(Homo sapiens (Human))
BDBM27535
(4-[(4-fluoro-3-{[4-(2-hydroxyethyl)-1,4-diazepan-1...)
Show SMILES OCCN1CCCN(CC1)C(=O)c1cc(Cc2n[nH]c(=O)c3ccccc23)ccc1F
Show InChI InChI=1S/C23H25FN4O3/c24-20-7-6-16(15-21-17-4-1-2-5-18(17)22(30)26-25-21)14-19(20)23(31)28-9-3-8-27(10-11-28)12-13-29/h1-2,4-7,14,29H,3,8-13,15H2,(H,26,30)
n/an/a 7n/an/an/an/a7.422
KuDOS Pharmaceuticals Ltd.
Assay Description
A FlashPlate scintillation proximity assay has been developed to identify inhibitors of PARP-1. The mechanism of action of the assay requires the bin...
J Med Chem 51: 6581-91 (2008)
Article DOI: 10.1021/jm8001263
BindingDB Entry DOI: 10.7270/Q2BP014T