BDBM27546 4-[(3-{[4-(pyrimidin-2-yl)piperazin-1-yl]carbonyl}phenyl)methyl]-1,2-dihydrophthalazin-1-one::Piperazine analogue, 27
SMILES: O=C(N1CCN(CC1)c1ncccn1)c1cccc(Cc2n[nH]c(=O)c3ccccc23)c1
InChI Key: InChIKey=SFUJPZOVEJALDI-UHFFFAOYSA-N
Data: 1 IC50
Activity Spreadsheet -- Enzyme Inhibition Constant Data from BindingDB
Found 1 hit for monomerid = 27546
Trg + Lig
Ki
nM
ΔG°
kcal/mole
IC50
nM
Kd
nM
EC50/IC50
nM
koff
s-1
kon
M-1s-1
pHTemp
°C
Poly [ADP-ribose] polymerase 1
(Homo sapiens (Human))
BDBM27546
(4-[(3-{[4-(pyrimidin-2-yl)piperazin-1-yl]carbonyl}...)
Show SMILES O=C(N1CCN(CC1)c1ncccn1)c1cccc(Cc2n[nH]c(=O)c3ccccc23)c1
Show InChI InChI=1S/C24H22N6O2/c31-22-20-8-2-1-7-19(20)21(27-28-22)16-17-5-3-6-18(15-17)23(32)29-11-13-30(14-12-29)24-25-9-4-10-26-24/h1-10,15H,11-14,16H2,(H,28,31)
n/an/a 2n/an/an/an/a7.422
KuDOS Pharmaceuticals Ltd.
Assay Description
A FlashPlate scintillation proximity assay has been developed to identify inhibitors of PARP-1. The mechanism of action of the assay requires the bin...
J Med Chem 51: 6581-91 (2008)
Article DOI: 10.1021/jm8001263
BindingDB Entry DOI: 10.7270/Q2BP014T