BDBM275777 US10071110, Compound 1-O-octadecylethanediol-2-CDV
SMILES: CCCCCCCCCCCCCCCCCCOCCOP(O)(=O)COC(CO)Cn1ccc(N)nc1=O
InChI Key: InChIKey=BLYNHZVAZVOTGV-UHFFFAOYSA-N
Data: 1 EC50
Activity Spreadsheet -- Enzyme Inhibition Constant Data from BindingDB
Found 1 hit for monomerid = 275777
Trg + Lig
Ki
nM
ΔG°
kcal/mole
IC50
nM
Kd
nM
EC50/IC50
nM
koff
s-1
kon
M-1s-1
pHTemp
°C
Fibroblast growth factor receptor 1
(Homo sapiens (Human))
BDBM275777
(US10071110, Compound 1-O-octadecylethanediol-2-CDV)
Show SMILES CCCCCCCCCCCCCCCCCCOCCOP(O)(=O)COC(CO)Cn1ccc(N)nc1=O
Show InChI InChI=1S/C28H54N3O7P/c1-2-3-4-5-6-7-8-9-10-11-12-13-14-15-16-17-20-36-21-22-38-39(34,35)25-37-26(24-32)23-31-19-18-27(29)30-28(31)33/h18-19,26,32H,2-17,20-25H2,1H3,(H,34,35)(H2,29,30,33)
NCI pathway
Reactome pathway
US Patent
n/an/an/an/a>1n/an/an/an/a
The Regents of the University of California
US Patent
Assay Description
Subconfluent human lung fibroblast cells (MRC-5, American Type Culture Collection, Rockville, Md.) in 24-well plates were treated with drugs diluted ...
US Patent US10071110 (2018)
BindingDB Entry DOI: 10.7270/Q2NS0WX9