null
SMILES: CCCCCCCCCCCCCCCCOCC(CO)OP1(=O)COC(CO1)n1ccc(N)nc1=O
InChI Key: InChIKey=GPFMXMZINJABPS-UHFFFAOYSA-N
Activity Spreadsheet -- Enzyme Inhibition Constant Data from BindingDB
Found 1 hit for monomerid = 275786
Trg + Lig
Ki
nM
ΔG°
kcal/mole
IC50
nM
Kd
nM
EC50/IC50
nM
koff
s-1
kon
M-1s-1
pHTemp
°C
HIV-1 protease
(Human immunodeficiency virus)
BDBM275786
(US10071110, Compound 1-O-octadecylpropanediol-2-cC...)
Show SMILES CCCCCCCCCCCCCCCCOCC(CO)OP1(=O)COC(CO1)n1ccc(N)nc1=O
Show InChI InChI=1S/C26H48N3O7P/c1-2-3-4-5-6-7-8-9-10-11-12-13-14-15-18-33-20-23(19-30)36-37(32)22-34-25(21-35-37)29-17-16-24(27)28-26(29)31/h16-17,23,25,30H,2-15,18-22H2,1H3,(H2,27,28,31)
US Patent
n/an/an/an/a 8n/an/an/an/a
The Regents of the University of California
US Patent
Assay Description
Subconfluent MRC-5 cells in 24-well culture dishes were inoculated by removing the medium and adding HSV-1 virus at a dilution that will result in a ...
US Patent US10071110 (2018)
BindingDB Entry DOI: 10.7270/Q2NS0WX9