BDBM27584 2-{4-[3-chloro-4-(2-{[1-(2-chloro-4-methylphenyl)-1H-1,2,3,4-tetrazol-5-yl]sulfanyl}acetamido)phenyl]phenyl}acetic acid::tetrazolyl compound, 7
SMILES: Cc1ccc(c(Cl)c1)-n1nnnc1SCC(=O)Nc1ccc(cc1Cl)-c1ccc(CC(O)=O)cc1
InChI Key: InChIKey=UHFCCMIQVBHAMO-UHFFFAOYSA-N
Data: 2 IC50
Activity Spreadsheet -- Enzyme Inhibition Constant Data from BindingDB
Found 2 hits for monomerid = 27584
Trg + Lig
Ki
nM
ΔG°
kcal/mole
IC50
nM
Kd
nM
EC50/IC50
nM
koff
s-1
kon
M-1s-1
pHTemp
°C
HIV-1 Reverse Transcriptase Mutant (103N/181C)
(Human immunodeficiency virus type 1)
BDBM27584
(2-{4-[3-chloro-4-(2-{[1-(2-chloro-4-methylphenyl)-...)
Show SMILES Cc1ccc(c(Cl)c1)-n1nnnc1SCC(=O)Nc1ccc(cc1Cl)-c1ccc(CC(O)=O)cc1
Show InChI InChI=1S/C24H19Cl2N5O3S/c1-14-2-9-21(19(26)10-14)31-24(28-29-30-31)35-13-22(32)27-20-8-7-17(12-18(20)25)16-5-3-15(4-6-16)11-23(33)34/h2-10,12H,11,13H2,1H3,(H,27,32)(H,33,34)
n/an/a 48n/an/an/an/an/an/a
Boehringer Ingelheim (Canada) Ltd.
Assay Description
IC50 values for wild-type and mutant RTs were obtained from a scintillation prox imity assay using poly rC/biotin-dG15 and 3H-dGTP. Each value repres...
Bioorg Med Chem Lett 19: 1199-205 (2009)
Article DOI: 10.1016/j.bmcl.2008.12.074
BindingDB Entry DOI: 10.7270/Q2ZG6QKQ
HIV-1 Reverse Transcriptase
(Human immunodeficiency virus type 1 group M subtyp...)
BDBM27584
(2-{4-[3-chloro-4-(2-{[1-(2-chloro-4-methylphenyl)-...)
Show SMILES Cc1ccc(c(Cl)c1)-n1nnnc1SCC(=O)Nc1ccc(cc1Cl)-c1ccc(CC(O)=O)cc1
Show InChI InChI=1S/C24H19Cl2N5O3S/c1-14-2-9-21(19(26)10-14)31-24(28-29-30-31)35-13-22(32)27-20-8-7-17(12-18(20)25)16-5-3-15(4-6-16)11-23(33)34/h2-10,12H,11,13H2,1H3,(H,27,32)(H,33,34)
n/an/a 2.40n/an/an/an/a7.437
Boehringer Ingelheim (Canada) Ltd.
Assay Description
IC50 values for wild-type and mutant RTs were obtained from a scintillation proximity assay using poly rC/biotin-dG15 and 3H-dGTP. Each value represe...
Bioorg Med Chem Lett 19: 1199-205 (2009)
Article DOI: 10.1016/j.bmcl.2008.12.074
BindingDB Entry DOI: 10.7270/Q2ZG6QKQ