null
SMILES: Nc1cccc2c(Cc3ccc(Br)c(Oc4cc(Cl)cc(c4)C#N)c3F)n[nH]c12
InChI Key: InChIKey=GCEGOTUYYWDPTF-UHFFFAOYSA-N
Activity Spreadsheet -- Enzyme Inhibition Constant Data from BindingDB
Found 2 hits for monomerid = 27610
Trg + Lig
Ki
nM
ΔG°
kcal/mole
IC50
nM
Kd
nM
EC50/IC50
nM
koff
s-1
kon
M-1s-1
pHTemp
°C
Gag-Pol polyprotein [588-1027,K691N,Y769C]/[588-1147,K691N,Y769C]
(Human immunodeficiency virus type 1)
BDBM27610
(3-{3-[(7-amino-1H-indazol-3-yl)methyl]-6-bromo-2-f...)
Show SMILES Nc1cccc2c(Cc3ccc(Br)c(Oc4cc(Cl)cc(c4)C#N)c3F)n[nH]c12
Show InChI InChI=1S/C21H13BrClFN4O/c22-16-5-4-12(8-18-15-2-1-3-17(26)20(15)28-27-18)19(24)21(16)29-14-7-11(10-25)6-13(23)9-14/h1-7,9H,8,26H2,(H,27,28)
n/an/a 22n/a 84n/an/a8.030
Roche Palo Alto LLC
Assay Description
IC50s were obtained from the inhibition of the RNA-dependent DNA polymerase activity of the HIV-1 reverse transcriptase enzyme using a primer extensi...
J Med Chem 51: 7449-58 (2008)
Article DOI: 10.1021/jm800527x
BindingDB Entry DOI: 10.7270/Q2TQ5ZV0
Gag-Pol polyprotein [588-1027]
(Human immunodeficiency virus type 1 group M subtyp...)
BDBM27610
(3-{3-[(7-amino-1H-indazol-3-yl)methyl]-6-bromo-2-f...)
Show SMILES Nc1cccc2c(Cc3ccc(Br)c(Oc4cc(Cl)cc(c4)C#N)c3F)n[nH]c12
Show InChI InChI=1S/C21H13BrClFN4O/c22-16-5-4-12(8-18-15-2-1-3-17(26)20(15)28-27-18)19(24)21(16)29-14-7-11(10-25)6-13(23)9-14/h1-7,9H,8,26H2,(H,27,28)
n/an/a 24n/a 8n/an/a8.030
Roche Palo Alto LLC
Assay Description
IC50s were obtained from the inhibition of the RNA-dependent DNA polymerase activity of the HIV-1 reverse transcriptase enzyme using a primer extensi...
J Med Chem 51: 7449-58 (2008)
Article DOI: 10.1021/jm800527x
BindingDB Entry DOI: 10.7270/Q2TQ5ZV0
3D
3D Structure (docked)