BDBM276542 5-Chloro-2-[[1-(4-fluoro-3-methyl-phenyl)triazol-4-yl]methoxy]-4-::US10071988, Example 482::US10233173, Example 482
SMILES: Cc1cc(ccc1F)-n1cc(COc2ncc(Cl)c(C)n2)nn1
InChI Key: InChIKey=HJZBNGPFWRHXIG-UHFFFAOYSA-N
Data: 2 IC50
Activity Spreadsheet -- Enzyme Inhibition Constant Data from BindingDB
Found 2 hits for monomerid = 276542
Trg + Lig
Ki
nM
ΔG°
kcal/mole
IC50
nM
Kd
nM
EC50/IC50
nM
koff
s-1
kon
M-1s-1
pHTemp
°C
GluN1/GluN2B NMDA receptor
(Homo sapiens (Human))
BDBM276542
(5-Chloro-2-[[1-(4-fluoro-3-methyl-phenyl)triazol-4...)
Show SMILES Cc1cc(ccc1F)-n1cc(COc2ncc(Cl)c(C)n2)nn1
Show InChI InChI=1S/C15H13ClFN5O/c1-9-5-12(3-4-14(9)17)22-7-11(20-21-22)8-23-15-18-6-13(16)10(2)19-15/h3-7H,8H2,1-2H3
NCI pathway
Reactome pathway
US Patent
n/an/a 1n/an/an/an/an/an/a
Lund University
Assay Description
NMDA receptors are ion channels that are highly permeable to Ca2+ ions, rendering it possible to monitor NMDA receptor function using cell-based calc...
Bioorg Med Chem 14: 1215-20 (2006)
BindingDB Entry DOI: 10.7270/Q23R0W6K
Retinoic acid receptor RXR-alpha
(Homo sapiens (Human))
BDBM276542
(5-Chloro-2-[[1-(4-fluoro-3-methyl-phenyl)triazol-4...)
Show SMILES Cc1cc(ccc1F)-n1cc(COc2ncc(Cl)c(C)n2)nn1
Show InChI InChI=1S/C15H13ClFN5O/c1-9-5-12(3-4-14(9)17)22-7-11(20-21-22)8-23-15-18-6-13(16)10(2)19-15/h3-7H,8H2,1-2H3
NCI pathway
Reactome pathway
US Patent
n/an/a 1n/an/an/an/a7.425
JANSSEN PHARMACEUTICA NV
US Patent
Assay Description
NMDA receptors are ion channels that are highly permeable to Ca2+ ions, rendering it possible to monitor NMDA receptor function using cell-based calc...
US Patent US10071988 (2018)
BindingDB Entry DOI: 10.7270/Q20Z7591