null
SMILES: N#Cc1cc(ccc1OC1CCOCC1)-c1ccnc2[nH]c(cc12)-c1ccc(CN2CCOCC2)cc1
InChI Key: InChIKey=PRBYIDLQEMMFNC-UHFFFAOYSA-N
Activity Spreadsheet -- Enzyme Inhibition Constant Data from BindingDB
Found 4 hits for monomerid = 276816
Trg + Lig
Ki
nM
ΔG°
kcal/mole
IC50
nM
Kd
nM
EC50/IC50
nM
koff
s-1
kon
M-1s-1
pHTemp
°C
Inhibitor of nuclear factor kappa-B kinase subunit epsilon
(Homo sapiens (Human))
BDBM276816
(US10072001, Example 2 | US10259811, Example 2)
Show SMILES N#Cc1cc(ccc1OC1CCOCC1)-c1ccnc2[nH]c(cc12)-c1ccc(CN2CCOCC2)cc1
Show InChI InChI=1S/C30H30N4O3/c31-19-24-17-23(5-6-29(24)37-25-8-13-35-14-9-25)26-7-10-32-30-27(26)18-28(33-30)22-3-1-21(2-4-22)20-34-11-15-36-16-12-34/h1-7,10,17-18,25H,8-9,11-16,20H2,(H,32,33)
Reactome pathway
US Patent
n/an/a 1.5n/an/an/an/a7.0n/a
Gilead Sciences, Inc.
US Patent
Assay Description
Enzymatic activity of IKKε and TBK1 was measured using a homogeneous time resolved fluorescence resonance energy transfer (TR-FRET) assay that m...
US Patent US10072001 (2018)
BindingDB Entry DOI: 10.7270/Q27H1MMV
Serine/threonine-protein kinase TBK1
(Homo sapiens (Human))
BDBM276816
(US10072001, Example 2 | US10259811, Example 2)
Show SMILES N#Cc1cc(ccc1OC1CCOCC1)-c1ccnc2[nH]c(cc12)-c1ccc(CN2CCOCC2)cc1
Show InChI InChI=1S/C30H30N4O3/c31-19-24-17-23(5-6-29(24)37-25-8-13-35-14-9-25)26-7-10-32-30-27(26)18-28(33-30)22-3-1-21(2-4-22)20-34-11-15-36-16-12-34/h1-7,10,17-18,25H,8-9,11-16,20H2,(H,32,33)
US Patent
n/an/a 1.5n/an/an/an/an/an/a
University of Tokyo
Assay Description
Enzymatic activity of IKKε and TBK1 was measured using a homogeneous time resolved fluorescence resonance energy transfer (TR-FRET) assay that m...
Bioorg Med Chem 16: 4272-85 (2008)
BindingDB Entry DOI: 10.7270/Q2ZG6VKC
Inhibitor of nuclear factor kappa-B kinase subunit epsilon
(Homo sapiens (Human))
BDBM276816
(US10072001, Example 2 | US10259811, Example 2)
Show SMILES N#Cc1cc(ccc1OC1CCOCC1)-c1ccnc2[nH]c(cc12)-c1ccc(CN2CCOCC2)cc1
Show InChI InChI=1S/C30H30N4O3/c31-19-24-17-23(5-6-29(24)37-25-8-13-35-14-9-25)26-7-10-32-30-27(26)18-28(33-30)22-3-1-21(2-4-22)20-34-11-15-36-16-12-34/h1-7,10,17-18,25H,8-9,11-16,20H2,(H,32,33)
Reactome pathway
US Patent
n/an/a 1.5n/an/an/an/an/an/a
University of Tokyo
Assay Description
Enzymatic activity of IKKε and TBK1 was measured using a homogeneous time resolved fluorescence resonance energy transfer (TR-FRET) assay that m...
Bioorg Med Chem 16: 4272-85 (2008)
BindingDB Entry DOI: 10.7270/Q2ZG6VKC
Serine/threonine-protein kinase TBK1
(Homo sapiens (Human))
BDBM276816
(US10072001, Example 2 | US10259811, Example 2)
Show SMILES N#Cc1cc(ccc1OC1CCOCC1)-c1ccnc2[nH]c(cc12)-c1ccc(CN2CCOCC2)cc1
Show InChI InChI=1S/C30H30N4O3/c31-19-24-17-23(5-6-29(24)37-25-8-13-35-14-9-25)26-7-10-32-30-27(26)18-28(33-30)22-3-1-21(2-4-22)20-34-11-15-36-16-12-34/h1-7,10,17-18,25H,8-9,11-16,20H2,(H,32,33)
US Patent
n/an/a 1.5n/an/an/an/a7.0n/a
Gilead Sciences, Inc.
US Patent
Assay Description
Enzymatic activity of IKKε and TBK1 was measured using a homogeneous time resolved fluorescence resonance energy transfer (TR-FRET) assay that m...
US Patent US10072001 (2018)
BindingDB Entry DOI: 10.7270/Q27H1MMV