BDBM27689 3,5-dimethyl-11-thia-4,5,7-triazatricyclo[7.3.0.0^{2,6}]dodeca-1(9),2(6),3-trien-8-one::ring-fused pyrazolo pyridin-2-one, 6
SMILES: Cc1nn(C)c2[nH]c(=O)c3CSCc3c12
InChI Key: InChIKey=NLYHUQDZTGYOSR-UHFFFAOYSA-N
Data: 1 IC50
Activity Spreadsheet -- Enzyme Inhibition Constant Data from BindingDB
Found 1 hit for monomerid = 27689
Trg + Lig
Ki
nM
ΔG°
kcal/mole
IC50
nM
Kd
nM
EC50/IC50
nM
koff
s-1
kon
M-1s-1
pHTemp
°C
Poly [ADP-ribose] polymerase 1
(Homo sapiens (Human))
BDBM27689
(3,5-dimethyl-11-thia-4,5,7-triazatricyclo[7.3.0.0^...)
Show SMILES Cc1nn(C)c2[nH]c(=O)c3CSCc3c12
Show InChI InChI=1S/C10H11N3OS/c1-5-8-6-3-15-4-7(6)10(14)11-9(8)13(2)12-5/h3-4H2,1-2H3,(H,11,14)
n/an/a 92.7n/an/an/an/a8.023
Deltagen Research Laboratories
Assay Description
To assess the inhibitory activity of novel inhibitors, the PARP-1 enzyme assay was carried out in reaction mixture consisting of Escherichia coli str...
Bioorg Med Chem Lett 18: 5126-9 (2008)
Article DOI: 10.1016/j.bmcl.2008.07.091
BindingDB Entry DOI: 10.7270/Q29S1PCX