null
SMILES: N#Cc1cc(ccc1OC1CCOCC1)-c1ncnc2[nH]c(cc12)-c1ccc(cc1)N1CCOCC1
InChI Key: InChIKey=KBAJEJRIUHJWTK-UHFFFAOYSA-N
Activity Spreadsheet -- Enzyme Inhibition Constant Data from BindingDB
Found 4 hits for monomerid = 276902
Trg + Lig
Ki
nM
ΔG°
kcal/mole
IC50
nM
Kd
nM
EC50/IC50
nM
koff
s-1
kon
M-1s-1
pHTemp
°C
Inhibitor of nuclear factor kappa-B kinase subunit epsilon
(Homo sapiens (Human))
BDBM276902
(US10072001, Example 101 | US10259811, Example 101)
Show SMILES N#Cc1cc(ccc1OC1CCOCC1)-c1ncnc2[nH]c(cc12)-c1ccc(cc1)N1CCOCC1
Show InChI InChI=1S/C28H27N5O3/c29-17-21-15-20(3-6-26(21)36-23-7-11-34-12-8-23)27-24-16-25(32-28(24)31-18-30-27)19-1-4-22(5-2-19)33-9-13-35-14-10-33/h1-6,15-16,18,23H,7-14H2,(H,30,31,32)
Reactome pathway
US Patent
n/an/a 8.06n/an/an/an/a7.0n/a
Gilead Sciences, Inc.
US Patent
Assay Description
Enzymatic activity of IKKε and TBK1 was measured using a homogeneous time resolved fluorescence resonance energy transfer (TR-FRET) assay that m...
US Patent US10072001 (2018)
BindingDB Entry DOI: 10.7270/Q27H1MMV
Serine/threonine-protein kinase TBK1
(Homo sapiens (Human))
BDBM276902
(US10072001, Example 101 | US10259811, Example 101)
Show SMILES N#Cc1cc(ccc1OC1CCOCC1)-c1ncnc2[nH]c(cc12)-c1ccc(cc1)N1CCOCC1
Show InChI InChI=1S/C28H27N5O3/c29-17-21-15-20(3-6-26(21)36-23-7-11-34-12-8-23)27-24-16-25(32-28(24)31-18-30-27)19-1-4-22(5-2-19)33-9-13-35-14-10-33/h1-6,15-16,18,23H,7-14H2,(H,30,31,32)
US Patent
n/an/a 1.72n/an/an/an/an/an/a
University of Tokyo
Assay Description
Enzymatic activity of IKKε and TBK1 was measured using a homogeneous time resolved fluorescence resonance energy transfer (TR-FRET) assay that m...
Bioorg Med Chem 16: 4272-85 (2008)
BindingDB Entry DOI: 10.7270/Q2ZG6VKC
Inhibitor of nuclear factor kappa-B kinase subunit epsilon
(Homo sapiens (Human))
BDBM276902
(US10072001, Example 101 | US10259811, Example 101)
Show SMILES N#Cc1cc(ccc1OC1CCOCC1)-c1ncnc2[nH]c(cc12)-c1ccc(cc1)N1CCOCC1
Show InChI InChI=1S/C28H27N5O3/c29-17-21-15-20(3-6-26(21)36-23-7-11-34-12-8-23)27-24-16-25(32-28(24)31-18-30-27)19-1-4-22(5-2-19)33-9-13-35-14-10-33/h1-6,15-16,18,23H,7-14H2,(H,30,31,32)
Reactome pathway
US Patent
n/an/a 8.06n/an/an/an/an/an/a
University of Tokyo
Assay Description
Enzymatic activity of IKKε and TBK1 was measured using a homogeneous time resolved fluorescence resonance energy transfer (TR-FRET) assay that m...
Bioorg Med Chem 16: 4272-85 (2008)
BindingDB Entry DOI: 10.7270/Q2ZG6VKC
Serine/threonine-protein kinase TBK1
(Homo sapiens (Human))
BDBM276902
(US10072001, Example 101 | US10259811, Example 101)
Show SMILES N#Cc1cc(ccc1OC1CCOCC1)-c1ncnc2[nH]c(cc12)-c1ccc(cc1)N1CCOCC1
Show InChI InChI=1S/C28H27N5O3/c29-17-21-15-20(3-6-26(21)36-23-7-11-34-12-8-23)27-24-16-25(32-28(24)31-18-30-27)19-1-4-22(5-2-19)33-9-13-35-14-10-33/h1-6,15-16,18,23H,7-14H2,(H,30,31,32)
US Patent
n/an/a 1.72n/an/an/an/a7.0n/a
Gilead Sciences, Inc.
US Patent
Assay Description
Enzymatic activity of IKKε and TBK1 was measured using a homogeneous time resolved fluorescence resonance energy transfer (TR-FRET) assay that m...
US Patent US10072001 (2018)
BindingDB Entry DOI: 10.7270/Q27H1MMV