null
SMILES: O=C(N1CCOCC1)c1ccc(cc1)-c1cc2c(ncnc2[nH]1)-c1ccc(OC2CCOCC2)c(c1)C#N
InChI Key: InChIKey=BMLBSNHUAPOBHI-UHFFFAOYSA-N
Activity Spreadsheet -- Enzyme Inhibition Constant Data from BindingDB
Found 4 hits for monomerid = 277009
Trg + Lig
Ki
nM
ΔG°
kcal/mole
IC50
nM
Kd
nM
EC50/IC50
nM
koff
s-1
kon
M-1s-1
pHTemp
°C
Inhibitor of nuclear factor kappa-B kinase subunit epsilon
(Homo sapiens (Human))
BDBM277009
(US10072001, Example 186 | US10259811, Example 186)
Show SMILES O=C(N1CCOCC1)c1ccc(cc1)-c1cc2c(ncnc2[nH]1)-c1ccc(OC2CCOCC2)c(c1)C#N
Show InChI InChI=1S/C29H27N5O4/c30-17-22-15-21(5-6-26(22)38-23-7-11-36-12-8-23)27-24-16-25(33-28(24)32-18-31-27)19-1-3-20(4-2-19)29(35)34-9-13-37-14-10-34/h1-6,15-16,18,23H,7-14H2,(H,31,32,33)
Reactome pathway
US Patent
n/an/a 4.96n/an/an/an/a7.0n/a
Gilead Sciences, Inc.
US Patent
Assay Description
Enzymatic activity of IKKε and TBK1 was measured using a homogeneous time resolved fluorescence resonance energy transfer (TR-FRET) assay that m...
US Patent US10072001 (2018)
BindingDB Entry DOI: 10.7270/Q27H1MMV
Serine/threonine-protein kinase TBK1
(Homo sapiens (Human))
BDBM277009
(US10072001, Example 186 | US10259811, Example 186)
Show SMILES O=C(N1CCOCC1)c1ccc(cc1)-c1cc2c(ncnc2[nH]1)-c1ccc(OC2CCOCC2)c(c1)C#N
Show InChI InChI=1S/C29H27N5O4/c30-17-22-15-21(5-6-26(22)38-23-7-11-36-12-8-23)27-24-16-25(33-28(24)32-18-31-27)19-1-3-20(4-2-19)29(35)34-9-13-37-14-10-34/h1-6,15-16,18,23H,7-14H2,(H,31,32,33)
US Patent
n/an/a 1.62n/an/an/an/an/an/a
University of Tokyo
Assay Description
Enzymatic activity of IKKε and TBK1 was measured using a homogeneous time resolved fluorescence resonance energy transfer (TR-FRET) assay that m...
Bioorg Med Chem 16: 4272-85 (2008)
BindingDB Entry DOI: 10.7270/Q2ZG6VKC
Inhibitor of nuclear factor kappa-B kinase subunit epsilon
(Homo sapiens (Human))
BDBM277009
(US10072001, Example 186 | US10259811, Example 186)
Show SMILES O=C(N1CCOCC1)c1ccc(cc1)-c1cc2c(ncnc2[nH]1)-c1ccc(OC2CCOCC2)c(c1)C#N
Show InChI InChI=1S/C29H27N5O4/c30-17-22-15-21(5-6-26(22)38-23-7-11-36-12-8-23)27-24-16-25(33-28(24)32-18-31-27)19-1-3-20(4-2-19)29(35)34-9-13-37-14-10-34/h1-6,15-16,18,23H,7-14H2,(H,31,32,33)
Reactome pathway
US Patent
n/an/a 4.96n/an/an/an/an/an/a
University of Tokyo
Assay Description
Enzymatic activity of IKKε and TBK1 was measured using a homogeneous time resolved fluorescence resonance energy transfer (TR-FRET) assay that m...
Bioorg Med Chem 16: 4272-85 (2008)
BindingDB Entry DOI: 10.7270/Q2ZG6VKC
Serine/threonine-protein kinase TBK1
(Homo sapiens (Human))
BDBM277009
(US10072001, Example 186 | US10259811, Example 186)
Show SMILES O=C(N1CCOCC1)c1ccc(cc1)-c1cc2c(ncnc2[nH]1)-c1ccc(OC2CCOCC2)c(c1)C#N
Show InChI InChI=1S/C29H27N5O4/c30-17-22-15-21(5-6-26(22)38-23-7-11-36-12-8-23)27-24-16-25(33-28(24)32-18-31-27)19-1-3-20(4-2-19)29(35)34-9-13-37-14-10-34/h1-6,15-16,18,23H,7-14H2,(H,31,32,33)
US Patent
n/an/a 1.62n/an/an/an/a7.0n/a
Gilead Sciences, Inc.
US Patent
Assay Description
Enzymatic activity of IKKε and TBK1 was measured using a homogeneous time resolved fluorescence resonance energy transfer (TR-FRET) assay that m...
US Patent US10072001 (2018)
BindingDB Entry DOI: 10.7270/Q27H1MMV