BDBM277010 US10072001, Example 187::US10259811, Example 187
SMILES: CN1CCN(CC1)C(=O)c1ccc(cc1)-c1cc2c(ncnc2[nH]1)-c1ccc(OC2CCOCC2)c(c1)C#N
InChI Key: InChIKey=DYRXRIMUJAAMQI-UHFFFAOYSA-N
Data: 4 IC50
Activity Spreadsheet -- Enzyme Inhibition Constant Data from BindingDB
Found 4 hits for monomerid = 277010
Trg + Lig
Ki
nM
ΔG°
kcal/mole
IC50
nM
Kd
nM
EC50/IC50
nM
koff
s-1
kon
M-1s-1
pHTemp
°C
Inhibitor of nuclear factor kappa-B kinase subunit epsilon
(Homo sapiens (Human))
BDBM277010
(US10072001, Example 187 | US10259811, Example 187)
Show SMILES CN1CCN(CC1)C(=O)c1ccc(cc1)-c1cc2c(ncnc2[nH]1)-c1ccc(OC2CCOCC2)c(c1)C#N
Show InChI InChI=1S/C30H30N6O3/c1-35-10-12-36(13-11-35)30(37)21-4-2-20(3-5-21)26-17-25-28(32-19-33-29(25)34-26)22-6-7-27(23(16-22)18-31)39-24-8-14-38-15-9-24/h2-7,16-17,19,24H,8-15H2,1H3,(H,32,33,34)
Reactome pathway
US Patent
n/an/a 1.88n/an/an/an/a7.0n/a
Gilead Sciences, Inc.
US Patent
Assay Description
Enzymatic activity of IKKε and TBK1 was measured using a homogeneous time resolved fluorescence resonance energy transfer (TR-FRET) assay that m...
US Patent US10072001 (2018)
BindingDB Entry DOI: 10.7270/Q27H1MMV
Protein cereblon/Serine/threonine-protein kinase TBK1
(Homo sapiens (Human))
BDBM277010
(US10072001, Example 187 | US10259811, Example 187)
Show SMILES CN1CCN(CC1)C(=O)c1ccc(cc1)-c1cc2c(ncnc2[nH]1)-c1ccc(OC2CCOCC2)c(c1)C#N
Show InChI InChI=1S/C30H30N6O3/c1-35-10-12-36(13-11-35)30(37)21-4-2-20(3-5-21)26-17-25-28(32-19-33-29(25)34-26)22-6-7-27(23(16-22)18-31)39-24-8-14-38-15-9-24/h2-7,16-17,19,24H,8-15H2,1H3,(H,32,33,34)
US Patent
n/an/a 1.16n/an/an/an/an/an/a
University of Tokyo
Assay Description
Enzymatic activity of IKKε and TBK1 was measured using a homogeneous time resolved fluorescence resonance energy transfer (TR-FRET) assay that m...
Bioorg Med Chem 16: 4272-85 (2008)
BindingDB Entry DOI: 10.7270/Q2ZG6VKC
Inhibitor of nuclear factor kappa-B kinase subunit epsilon
(Homo sapiens (Human))
BDBM277010
(US10072001, Example 187 | US10259811, Example 187)
Show SMILES CN1CCN(CC1)C(=O)c1ccc(cc1)-c1cc2c(ncnc2[nH]1)-c1ccc(OC2CCOCC2)c(c1)C#N
Show InChI InChI=1S/C30H30N6O3/c1-35-10-12-36(13-11-35)30(37)21-4-2-20(3-5-21)26-17-25-28(32-19-33-29(25)34-26)22-6-7-27(23(16-22)18-31)39-24-8-14-38-15-9-24/h2-7,16-17,19,24H,8-15H2,1H3,(H,32,33,34)
Reactome pathway
US Patent
n/an/a 1.88n/an/an/an/an/an/a
University of Tokyo
Assay Description
Enzymatic activity of IKKε and TBK1 was measured using a homogeneous time resolved fluorescence resonance energy transfer (TR-FRET) assay that m...
Bioorg Med Chem 16: 4272-85 (2008)
BindingDB Entry DOI: 10.7270/Q2ZG6VKC
Protein cereblon/Serine/threonine-protein kinase TBK1
(Homo sapiens (Human))
BDBM277010
(US10072001, Example 187 | US10259811, Example 187)
Show SMILES CN1CCN(CC1)C(=O)c1ccc(cc1)-c1cc2c(ncnc2[nH]1)-c1ccc(OC2CCOCC2)c(c1)C#N
Show InChI InChI=1S/C30H30N6O3/c1-35-10-12-36(13-11-35)30(37)21-4-2-20(3-5-21)26-17-25-28(32-19-33-29(25)34-26)22-6-7-27(23(16-22)18-31)39-24-8-14-38-15-9-24/h2-7,16-17,19,24H,8-15H2,1H3,(H,32,33,34)
US Patent
n/an/a 1.16n/an/an/an/a7.0n/a
Gilead Sciences, Inc.
US Patent
Assay Description
Enzymatic activity of IKKε and TBK1 was measured using a homogeneous time resolved fluorescence resonance energy transfer (TR-FRET) assay that m...
US Patent US10072001 (2018)
BindingDB Entry DOI: 10.7270/Q27H1MMV