null
SMILES: CNC(=O)CN1[C@H]2CCC[C@@H]1C[C@H](C2)Nc1nc(Nc2cc(C)[nH]n2)cc2ncccc12
InChI Key:
Activity Spreadsheet -- Enzyme Inhibition Constant Data from BindingDB
Found 8 hits for monomerid = 277406
Trg + Lig
Ki
nM
ΔG°
kcal/mole
IC50
nM
Kd
nM
EC50/IC50
nM
koff
s-1
kon
M-1s-1
pHTemp
°C
Tyrosine-protein kinase JAK2
(Homo sapiens (Human))
BDBM277406
(N-methyl-2-((1R,3s,5S)-3-((7-((5-methyl-1H-pyrazol...)
Show SMILES CNC(=O)CN1[C@H]2CCC[C@@H]1C[C@H](C2)Nc1nc(Nc2cc(C)[nH]n2)cc2ncccc12 |r,TLB:4:5:9.8.7:12.11.13|
Reactome pathway
US Patent
<0.100n/an/an/an/an/an/a7.5n/a
THERAVANCE BIOPHARMA R&D IP, LLC
US Patent
Assay Description
A panel of four LanthaScreen JAK biochemical assays (JAK1, 2, 3 and Tyk2) were carried in a common kinase reaction buffer (50 mM HEPES, pH 7.5, 0.01%...
US Patent US10072026 (2018)
BindingDB Entry DOI: 10.7270/Q2G162VM
Tyrosine-protein kinase JAK2
(Homo sapiens (Human))
BDBM277406
(N-methyl-2-((1R,3s,5S)-3-((7-((5-methyl-1H-pyrazol...)
Show SMILES CNC(=O)CN1[C@H]2CCC[C@@H]1C[C@H](C2)Nc1nc(Nc2cc(C)[nH]n2)cc2ncccc12 |r,TLB:4:5:9.8.7:12.11.13|
Reactome pathway
US Patent
<0.100n/an/an/an/an/an/an/an/a
Theravance Biopharma R&D IP, LLC
US Patent
Assay Description
A panel of four LanthaScreen JAK biochemical assays (JAK1, 2, 3 and Tyk2) were carried in a common kinase reaction buffer (50 mM HEPES, pH 7.5, 0.01%...
US Patent US10947254 (2021)
Non-receptor tyrosine-protein kinase TYK2
(Homo sapiens (Human))
BDBM277406
(N-methyl-2-((1R,3s,5S)-3-((7-((5-methyl-1H-pyrazol...)
Show SMILES CNC(=O)CN1[C@H]2CCC[C@@H]1C[C@H](C2)Nc1nc(Nc2cc(C)[nH]n2)cc2ncccc12 |r,TLB:4:5:9.8.7:12.11.13|
US Patent
0.550n/an/an/an/an/an/an/an/a
Theravance Biopharma R&D IP, LLC
US Patent
Assay Description
A panel of four LanthaScreen JAK biochemical assays (JAK1, 2, 3 and Tyk2) were carried in a common kinase reaction buffer (50 mM HEPES, pH 7.5, 0.01%...
US Patent US10947254 (2021)
Tyrosine-protein kinase JAK1
(Homo sapiens (Human))
BDBM277406
(N-methyl-2-((1R,3s,5S)-3-((7-((5-methyl-1H-pyrazol...)
Show SMILES CNC(=O)CN1[C@H]2CCC[C@@H]1C[C@H](C2)Nc1nc(Nc2cc(C)[nH]n2)cc2ncccc12 |r,TLB:4:5:9.8.7:12.11.13|
Reactome pathway
US Patent
0.550n/an/an/an/an/an/an/an/a
Theravance Biopharma R&D IP, LLC
US Patent
Assay Description
A panel of four LanthaScreen JAK biochemical assays (JAK1, 2, 3 and Tyk2) were carried in a common kinase reaction buffer (50 mM HEPES, pH 7.5, 0.01%...
US Patent US10947254 (2021)
Tyrosine-protein kinase JAK3
(Homo sapiens (Human))
BDBM277406
(N-methyl-2-((1R,3s,5S)-3-((7-((5-methyl-1H-pyrazol...)
Show SMILES CNC(=O)CN1[C@H]2CCC[C@@H]1C[C@H](C2)Nc1nc(Nc2cc(C)[nH]n2)cc2ncccc12 |r,TLB:4:5:9.8.7:12.11.13|
Reactome pathway
US Patent
0.550n/an/an/an/an/an/an/an/a
Theravance Biopharma R&D IP, LLC
US Patent
Assay Description
A panel of four LanthaScreen JAK biochemical assays (JAK1, 2, 3 and Tyk2) were carried in a common kinase reaction buffer (50 mM HEPES, pH 7.5, 0.01%...
US Patent US10947254 (2021)
Tyrosine-protein kinase JAK3
(Homo sapiens (Human))
BDBM277406
(N-methyl-2-((1R,3s,5S)-3-((7-((5-methyl-1H-pyrazol...)
Show SMILES CNC(=O)CN1[C@H]2CCC[C@@H]1C[C@H](C2)Nc1nc(Nc2cc(C)[nH]n2)cc2ncccc12 |r,TLB:4:5:9.8.7:12.11.13|
Reactome pathway
US Patent
0.550n/an/an/an/an/an/a7.5n/a
THERAVANCE BIOPHARMA R&D IP, LLC
US Patent
Assay Description
A panel of four LanthaScreen JAK biochemical assays (JAK1, 2, 3 and Tyk2) were carried in a common kinase reaction buffer (50 mM HEPES, pH 7.5, 0.01%...
US Patent US10072026 (2018)
BindingDB Entry DOI: 10.7270/Q2G162VM
Tyrosine-protein kinase JAK1
(Homo sapiens (Human))
BDBM277406
(N-methyl-2-((1R,3s,5S)-3-((7-((5-methyl-1H-pyrazol...)
Show SMILES CNC(=O)CN1[C@H]2CCC[C@@H]1C[C@H](C2)Nc1nc(Nc2cc(C)[nH]n2)cc2ncccc12 |r,TLB:4:5:9.8.7:12.11.13|
Reactome pathway
US Patent
0.550n/an/an/an/an/an/a7.5n/a
THERAVANCE BIOPHARMA R&D IP, LLC
US Patent
Assay Description
A panel of four LanthaScreen JAK biochemical assays (JAK1, 2, 3 and Tyk2) were carried in a common kinase reaction buffer (50 mM HEPES, pH 7.5, 0.01%...
US Patent US10072026 (2018)
BindingDB Entry DOI: 10.7270/Q2G162VM
Non-receptor tyrosine-protein kinase TYK2
(Homo sapiens (Human))
BDBM277406
(N-methyl-2-((1R,3s,5S)-3-((7-((5-methyl-1H-pyrazol...)
Show SMILES CNC(=O)CN1[C@H]2CCC[C@@H]1C[C@H](C2)Nc1nc(Nc2cc(C)[nH]n2)cc2ncccc12 |r,TLB:4:5:9.8.7:12.11.13|
US Patent
0.550n/an/an/an/an/an/a7.5n/a
THERAVANCE BIOPHARMA R&D IP, LLC
US Patent
Assay Description
A panel of four LanthaScreen JAK biochemical assays (JAK1, 2, 3 and Tyk2) were carried in a common kinase reaction buffer (50 mM HEPES, pH 7.5, 0.01%...
US Patent US10072026 (2018)
BindingDB Entry DOI: 10.7270/Q2G162VM