null
SMILES: Cc1cc(Nc2cc3ncccc3c(N[C@H]3C[C@@H]4CCC[C@H](C3)N4C(=O)CCCC#N)n2)n[nH]1
InChI Key:
Activity Spreadsheet -- Enzyme Inhibition Constant Data from BindingDB
Found 12 hits for monomerid = 277491
Trg + Lig
Ki
nM
ΔG°
kcal/mole
IC50
nM
Kd
nM
EC50/IC50
nM
koff
s-1
kon
M-1s-1
pHTemp
°C
Tyrosine-protein kinase JAK1
(Homo sapiens (Human))
BDBM277491
(US10072026, Example 2-27 | US10947254, Example 2-2...)
Show SMILES Cc1cc(Nc2cc3ncccc3c(N[C@H]3C[C@@H]4CCC[C@H](C3)N4C(=O)CCCC#N)n2)n[nH]1 |r,TLB:24:23:15.22.16:20.18.19|
Reactome pathway
US Patent
0.550n/an/an/an/an/an/a7.5n/a
THERAVANCE BIOPHARMA R&D IP, LLC
US Patent
Assay Description
A panel of four LanthaScreen JAK biochemical assays (JAK1, 2, 3 and Tyk2) were carried in a common kinase reaction buffer (50 mM HEPES, pH 7.5, 0.01%...
US Patent US10072026 (2018)
BindingDB Entry DOI: 10.7270/Q2G162VM
Tyrosine-protein kinase JAK2
(Homo sapiens (Human))
BDBM277491
(US10072026, Example 2-27 | US10947254, Example 2-2...)
Show SMILES Cc1cc(Nc2cc3ncccc3c(N[C@H]3C[C@@H]4CCC[C@H](C3)N4C(=O)CCCC#N)n2)n[nH]1 |r,TLB:24:23:15.22.16:20.18.19|
Reactome pathway
US Patent
0.550n/an/an/an/an/an/a7.5n/a
THERAVANCE BIOPHARMA R&D IP, LLC
US Patent
Assay Description
A panel of four LanthaScreen JAK biochemical assays (JAK1, 2, 3 and Tyk2) were carried in a common kinase reaction buffer (50 mM HEPES, pH 7.5, 0.01%...
US Patent US10072026 (2018)
BindingDB Entry DOI: 10.7270/Q2G162VM
Tyrosine-protein kinase JAK2
(Homo sapiens (Human))
BDBM277491
(US10072026, Example 2-27 | US10947254, Example 2-2...)
Show SMILES Cc1cc(Nc2cc3ncccc3c(N[C@H]3C[C@@H]4CCC[C@H](C3)N4C(=O)CCCC#N)n2)n[nH]1 |r,TLB:24:23:15.22.16:20.18.19|
Reactome pathway
US Patent
0.550n/an/an/an/an/an/an/an/a
Theravance Biopharma R&D IP, LLC
US Patent
Assay Description
A panel of four LanthaScreen JAK biochemical assays (JAK1, 2, 3 and Tyk2) were carried in a common kinase reaction buffer (50 mM HEPES, pH 7.5, 0.01%...
US Patent US10947254 (2021)
BindingDB Entry DOI: 10.7270/Q2KH0RF0
Tyrosine-protein kinase JAK2
(Homo sapiens (Human))
BDBM277491
(US10072026, Example 2-27 | US10947254, Example 2-2...)
Show SMILES Cc1cc(Nc2cc3ncccc3c(N[C@H]3C[C@@H]4CCC[C@H](C3)N4C(=O)CCCC#N)n2)n[nH]1 |r,TLB:24:23:15.22.16:20.18.19|
Reactome pathway
0.550n/an/an/an/an/an/an/an/a
TBA
Citation and Details
Tyrosine-protein kinase JAK1
(Homo sapiens (Human))
BDBM277491
(US10072026, Example 2-27 | US10947254, Example 2-2...)
Show SMILES Cc1cc(Nc2cc3ncccc3c(N[C@H]3C[C@@H]4CCC[C@H](C3)N4C(=O)CCCC#N)n2)n[nH]1 |r,TLB:24:23:15.22.16:20.18.19|
Reactome pathway
0.550n/an/an/an/an/an/an/an/a
TBA
Citation and Details
Non-receptor tyrosine-protein kinase TYK2
(Homo sapiens (Human))
BDBM277491
(US10072026, Example 2-27 | US10947254, Example 2-2...)
Show SMILES Cc1cc(Nc2cc3ncccc3c(N[C@H]3C[C@@H]4CCC[C@H](C3)N4C(=O)CCCC#N)n2)n[nH]1 |r,TLB:24:23:15.22.16:20.18.19|
US Patent
0.550n/an/an/an/an/an/a7.5n/a
THERAVANCE BIOPHARMA R&D IP, LLC
US Patent
Assay Description
A panel of four LanthaScreen JAK biochemical assays (JAK1, 2, 3 and Tyk2) were carried in a common kinase reaction buffer (50 mM HEPES, pH 7.5, 0.01%...
US Patent US10072026 (2018)
BindingDB Entry DOI: 10.7270/Q2G162VM
Tyrosine-protein kinase JAK1
(Homo sapiens (Human))
BDBM277491
(US10072026, Example 2-27 | US10947254, Example 2-2...)
Show SMILES Cc1cc(Nc2cc3ncccc3c(N[C@H]3C[C@@H]4CCC[C@H](C3)N4C(=O)CCCC#N)n2)n[nH]1 |r,TLB:24:23:15.22.16:20.18.19|
Reactome pathway
US Patent
0.550n/an/an/an/an/an/an/an/a
Theravance Biopharma R&D IP, LLC
US Patent
Assay Description
A panel of four LanthaScreen JAK biochemical assays (JAK1, 2, 3 and Tyk2) were carried in a common kinase reaction buffer (50 mM HEPES, pH 7.5, 0.01%...
US Patent US10947254 (2021)
BindingDB Entry DOI: 10.7270/Q2KH0RF0
Non-receptor tyrosine-protein kinase TYK2
(Homo sapiens (Human))
BDBM277491
(US10072026, Example 2-27 | US10947254, Example 2-2...)
Show SMILES Cc1cc(Nc2cc3ncccc3c(N[C@H]3C[C@@H]4CCC[C@H](C3)N4C(=O)CCCC#N)n2)n[nH]1 |r,TLB:24:23:15.22.16:20.18.19|
0.550n/an/an/an/an/an/an/an/a
TBA
Citation and Details
Non-receptor tyrosine-protein kinase TYK2
(Homo sapiens (Human))
BDBM277491
(US10072026, Example 2-27 | US10947254, Example 2-2...)
Show SMILES Cc1cc(Nc2cc3ncccc3c(N[C@H]3C[C@@H]4CCC[C@H](C3)N4C(=O)CCCC#N)n2)n[nH]1 |r,TLB:24:23:15.22.16:20.18.19|
US Patent
0.550n/an/an/an/an/an/an/an/a
Theravance Biopharma R&D IP, LLC
US Patent
Assay Description
A panel of four LanthaScreen JAK biochemical assays (JAK1, 2, 3 and Tyk2) were carried in a common kinase reaction buffer (50 mM HEPES, pH 7.5, 0.01%...
US Patent US10947254 (2021)
BindingDB Entry DOI: 10.7270/Q2KH0RF0
Tyrosine-protein kinase JAK3
(Homo sapiens (Human))
BDBM277491
(US10072026, Example 2-27 | US10947254, Example 2-2...)
Show SMILES Cc1cc(Nc2cc3ncccc3c(N[C@H]3C[C@@H]4CCC[C@H](C3)N4C(=O)CCCC#N)n2)n[nH]1 |r,TLB:24:23:15.22.16:20.18.19|
Reactome pathway
US Patent
50n/an/an/an/an/an/an/an/a
Theravance Biopharma R&D IP, LLC
US Patent
Assay Description
A panel of four LanthaScreen JAK biochemical assays (JAK1, 2, 3 and Tyk2) were carried in a common kinase reaction buffer (50 mM HEPES, pH 7.5, 0.01%...
US Patent US10947254 (2021)
BindingDB Entry DOI: 10.7270/Q2KH0RF0
Tyrosine-protein kinase JAK3
(Homo sapiens (Human))
BDBM277491
(US10072026, Example 2-27 | US10947254, Example 2-2...)
Show SMILES Cc1cc(Nc2cc3ncccc3c(N[C@H]3C[C@@H]4CCC[C@H](C3)N4C(=O)CCCC#N)n2)n[nH]1 |r,TLB:24:23:15.22.16:20.18.19|
Reactome pathway
US Patent
50n/an/an/an/an/an/a7.5n/a
THERAVANCE BIOPHARMA R&D IP, LLC
US Patent
Assay Description
A panel of four LanthaScreen JAK biochemical assays (JAK1, 2, 3 and Tyk2) were carried in a common kinase reaction buffer (50 mM HEPES, pH 7.5, 0.01%...
US Patent US10072026 (2018)
BindingDB Entry DOI: 10.7270/Q2G162VM
Tyrosine-protein kinase JAK3
(Homo sapiens (Human))
BDBM277491
(US10072026, Example 2-27 | US10947254, Example 2-2...)
Show SMILES Cc1cc(Nc2cc3ncccc3c(N[C@H]3C[C@@H]4CCC[C@H](C3)N4C(=O)CCCC#N)n2)n[nH]1 |r,TLB:24:23:15.22.16:20.18.19|
Reactome pathway
50.5n/an/an/an/an/an/an/an/a
TBA
Citation and Details