BDBM277706 3-(1,2-benzoxazol-3-ylamino]pyridine-4-carboxylic acid::US10040779, Example 3::US10336727, Example 3::US9617242, Example 3
SMILES: OC(=O)c1ccncc1Nc1noc2ccccc12
InChI Key: InChIKey=BISRMYZLPKDLOS-UHFFFAOYSA-N
Data: 9 IC50
Activity Spreadsheet -- Enzyme Inhibition Constant Data from BindingDB
Found 9 hits for monomerid = 277706
Trg + Lig
Ki
nM
ΔG°
kcal/mole
IC50
nM
Kd
nM
EC50/IC50
nM
koff
s-1
kon
M-1s-1
pHTemp
°C
Lysine-specific demethylase 5A
(Homo sapiens (Human))
BDBM277706
(3-(1,2-benzoxazol-3-ylamino]pyridine-4-carboxylic ...)
Show SMILES OC(=O)c1ccncc1Nc1noc2ccccc12
Show InChI InChI=1S/C13H9N3O3/c17-13(18)8-5-6-14-7-10(8)15-12-9-3-1-2-4-11(9)19-16-12/h1-7H,(H,15,16)(H,17,18)
Reactome pathway
US Patent
n/an/a<0.100n/an/an/an/an/an/a
Celgene Quanticel Research, Inc.
US Patent
Assay Description
The enzymatic assay of Jarid1A activity is based upon Time Resolved-Fluorescence Resonance Energy Transfer (TR-FRET) detection. The ability of test c...
US Patent US10040779 (2018)
BindingDB Entry DOI: 10.7270/Q26H4KF1
Lysine-specific demethylase 5B
(Homo sapiens (Human))
BDBM277706
(3-(1,2-benzoxazol-3-ylamino]pyridine-4-carboxylic ...)
Show SMILES OC(=O)c1ccncc1Nc1noc2ccccc12
Show InChI InChI=1S/C13H9N3O3/c17-13(18)8-5-6-14-7-10(8)15-12-9-3-1-2-4-11(9)19-16-12/h1-7H,(H,15,16)(H,17,18)
US Patent
n/an/a<0.100n/an/an/an/an/an/a
Celgene Quanticel Research, Inc.
US Patent
Assay Description
The ability of test compounds to inhibit the activity of Jarid1B was determined in 384-well plate format under the following reaction conditions: 0.8...
US Patent US10040779 (2018)
BindingDB Entry DOI: 10.7270/Q26H4KF1
Lysine-specific demethylase 4C
(Homo sapiens (Human))
BDBM277706
(3-(1,2-benzoxazol-3-ylamino]pyridine-4-carboxylic ...)
Show SMILES OC(=O)c1ccncc1Nc1noc2ccccc12
Show InChI InChI=1S/C13H9N3O3/c17-13(18)8-5-6-14-7-10(8)15-12-9-3-1-2-4-11(9)19-16-12/h1-7H,(H,15,16)(H,17,18)
US Patent
n/an/a<0.100n/an/an/an/an/an/a
Celgene Quanticel Research, Inc.
US Patent
Assay Description
The ability of test compounds to inhibit the activity of JMJD2C was determined in 384-well plate format under the following reaction conditions: 0.3 ...
US Patent US10040779 (2018)
BindingDB Entry DOI: 10.7270/Q26H4KF1
Lysine-specific demethylase 5A
(Homo sapiens (Human))
BDBM277706
(3-(1,2-benzoxazol-3-ylamino]pyridine-4-carboxylic ...)
Show SMILES OC(=O)c1ccncc1Nc1noc2ccccc12
Show InChI InChI=1S/C13H9N3O3/c17-13(18)8-5-6-14-7-10(8)15-12-9-3-1-2-4-11(9)19-16-12/h1-7H,(H,15,16)(H,17,18)
Reactome pathway
US Patent
n/an/a<100n/an/an/an/an/an/a
CELGENE QUANTICEL RESEARCH, INC.
US Patent
Assay Description
The enzymatic assay of Jarid1A activity is based upon Time Resolved-Fluorescence Resonance Energy Transfer (TR-FRET) detection. The ability of test c...
US Patent US9617242 (2017)
BindingDB Entry DOI: 10.7270/Q2XK8HM5
Lysine-specific demethylase 4C
(Homo sapiens (Human))
BDBM277706
(3-(1,2-benzoxazol-3-ylamino]pyridine-4-carboxylic ...)
Show SMILES OC(=O)c1ccncc1Nc1noc2ccccc12
Show InChI InChI=1S/C13H9N3O3/c17-13(18)8-5-6-14-7-10(8)15-12-9-3-1-2-4-11(9)19-16-12/h1-7H,(H,15,16)(H,17,18)
US Patent
n/an/a<100n/an/an/an/an/an/a
Celgene Quanticel Research Inc
US Patent
Assay Description
The ability of test compounds to inhibit the activity of JMJD2C was determined in 384-well plate format under the following reaction conditions: 0.3 ...
US Patent US10336727 (2019)
BindingDB Entry DOI: 10.7270/Q2571FBT
Lysine-specific demethylase 4C
(Homo sapiens (Human))
BDBM277706
(3-(1,2-benzoxazol-3-ylamino]pyridine-4-carboxylic ...)
Show SMILES OC(=O)c1ccncc1Nc1noc2ccccc12
Show InChI InChI=1S/C13H9N3O3/c17-13(18)8-5-6-14-7-10(8)15-12-9-3-1-2-4-11(9)19-16-12/h1-7H,(H,15,16)(H,17,18)
US Patent
n/an/a<100n/an/an/an/an/an/a
CELGENE QUANTICEL RESEARCH, INC.
US Patent
Assay Description
The ability of test compounds to inhibit the activity of JMJD2C was determined in 384-well plate format under the following reaction conditions: 0.3 ...
US Patent US9617242 (2017)
BindingDB Entry DOI: 10.7270/Q2XK8HM5
Lysine-specific demethylase 5A
(Homo sapiens (Human))
BDBM277706
(3-(1,2-benzoxazol-3-ylamino]pyridine-4-carboxylic ...)
Show SMILES OC(=O)c1ccncc1Nc1noc2ccccc12
Show InChI InChI=1S/C13H9N3O3/c17-13(18)8-5-6-14-7-10(8)15-12-9-3-1-2-4-11(9)19-16-12/h1-7H,(H,15,16)(H,17,18)
Reactome pathway
US Patent
n/an/a<100n/an/an/an/an/an/a
Celgene Quanticel Research Inc
US Patent
Assay Description
The enzymatic assay of Jarid1A activity is based upon Time Resolved-Fluorescence Resonance Energy Transfer (TR-FRET) detection. The ability of test c...
US Patent US10336727 (2019)
BindingDB Entry DOI: 10.7270/Q2571FBT
Lysine-specific demethylase 5B
(Homo sapiens (Human))
BDBM277706
(3-(1,2-benzoxazol-3-ylamino]pyridine-4-carboxylic ...)
Show SMILES OC(=O)c1ccncc1Nc1noc2ccccc12
Show InChI InChI=1S/C13H9N3O3/c17-13(18)8-5-6-14-7-10(8)15-12-9-3-1-2-4-11(9)19-16-12/h1-7H,(H,15,16)(H,17,18)
US Patent
n/an/a<100n/an/an/an/an/an/a
Celgene Quanticel Research Inc
US Patent
Assay Description
The ability of test compounds to inhibit the activity of Jarid1B was determined in 384-well plate format under the following reaction conditions: 0.8...
US Patent US10336727 (2019)
BindingDB Entry DOI: 10.7270/Q2571FBT
Lysine-specific demethylase 5B
(Homo sapiens (Human))
BDBM277706
(3-(1,2-benzoxazol-3-ylamino]pyridine-4-carboxylic ...)
Show SMILES OC(=O)c1ccncc1Nc1noc2ccccc12
Show InChI InChI=1S/C13H9N3O3/c17-13(18)8-5-6-14-7-10(8)15-12-9-3-1-2-4-11(9)19-16-12/h1-7H,(H,15,16)(H,17,18)
US Patent
n/an/a<100n/an/an/an/an/an/a
CELGENE QUANTICEL RESEARCH, INC.
US Patent
Assay Description
The ability of test compounds to inhibit the activity of Jarid1B was determined in 384-well plate format under the following reaction conditions: 0.8...
US Patent US9617242 (2017)
BindingDB Entry DOI: 10.7270/Q2XK8HM5