BDBM277738 3-{[5-chloro-1-(3,3,3-trifluoropropyl)-1H-indazol-3-yl]amino}pyridine-4-carboxylic acid::US10040779, Example 35::US10336727, Example 35::US9617242, Example 35
SMILES: OC(=O)c1ccncc1Nc1nn(CCC(F)(F)F)c2ccc(Cl)cc12
InChI Key: InChIKey=RWMFBPHVUBQDQE-UHFFFAOYSA-N
Data: 9 IC50
Activity Spreadsheet -- Enzyme Inhibition Constant Data from BindingDB
Found 9 hits for monomerid = 277738
Trg + Lig
Ki
nM
ΔG°
kcal/mole
IC50
nM
Kd
nM
EC50/IC50
nM
koff
s-1
kon
M-1s-1
pHTemp
°C
Lysine-specific demethylase 5A
(Homo sapiens (Human))
BDBM277738
(3-{[5-chloro-1-(3,3,3-trifluoropropyl)-1H-indazol-...)
Show SMILES OC(=O)c1ccncc1Nc1nn(CCC(F)(F)F)c2ccc(Cl)cc12
Show InChI InChI=1S/C16H12ClF3N4O2/c17-9-1-2-13-11(7-9)14(23-24(13)6-4-16(18,19)20)22-12-8-21-5-3-10(12)15(25)26/h1-3,5,7-8H,4,6H2,(H,22,23)(H,25,26)
Reactome pathway
US Patent
n/an/a<0.100n/an/an/an/an/an/a
Celgene Quanticel Research, Inc.
US Patent
Assay Description
The enzymatic assay of Jarid1A activity is based upon Time Resolved-Fluorescence Resonance Energy Transfer (TR-FRET) detection. The ability of test c...
US Patent US10040779 (2018)
BindingDB Entry DOI: 10.7270/Q26H4KF1
Lysine-specific demethylase 5B
(Homo sapiens (Human))
BDBM277738
(3-{[5-chloro-1-(3,3,3-trifluoropropyl)-1H-indazol-...)
Show SMILES OC(=O)c1ccncc1Nc1nn(CCC(F)(F)F)c2ccc(Cl)cc12
Show InChI InChI=1S/C16H12ClF3N4O2/c17-9-1-2-13-11(7-9)14(23-24(13)6-4-16(18,19)20)22-12-8-21-5-3-10(12)15(25)26/h1-3,5,7-8H,4,6H2,(H,22,23)(H,25,26)
US Patent
n/an/a<0.100n/an/an/an/an/an/a
Celgene Quanticel Research, Inc.
US Patent
Assay Description
The ability of test compounds to inhibit the activity of Jarid1B was determined in 384-well plate format under the following reaction conditions: 0.8...
US Patent US10040779 (2018)
BindingDB Entry DOI: 10.7270/Q26H4KF1
Lysine-specific demethylase 4C
(Homo sapiens (Human))
BDBM277738
(3-{[5-chloro-1-(3,3,3-trifluoropropyl)-1H-indazol-...)
Show SMILES OC(=O)c1ccncc1Nc1nn(CCC(F)(F)F)c2ccc(Cl)cc12
Show InChI InChI=1S/C16H12ClF3N4O2/c17-9-1-2-13-11(7-9)14(23-24(13)6-4-16(18,19)20)22-12-8-21-5-3-10(12)15(25)26/h1-3,5,7-8H,4,6H2,(H,22,23)(H,25,26)
US Patent
n/an/a 0.550n/an/an/an/an/an/a
Celgene Quanticel Research, Inc.
US Patent
Assay Description
The ability of test compounds to inhibit the activity of JMJD2C was determined in 384-well plate format under the following reaction conditions: 0.3 ...
US Patent US10040779 (2018)
BindingDB Entry DOI: 10.7270/Q26H4KF1
Lysine-specific demethylase 5A
(Homo sapiens (Human))
BDBM277738
(3-{[5-chloro-1-(3,3,3-trifluoropropyl)-1H-indazol-...)
Show SMILES OC(=O)c1ccncc1Nc1nn(CCC(F)(F)F)c2ccc(Cl)cc12
Show InChI InChI=1S/C16H12ClF3N4O2/c17-9-1-2-13-11(7-9)14(23-24(13)6-4-16(18,19)20)22-12-8-21-5-3-10(12)15(25)26/h1-3,5,7-8H,4,6H2,(H,22,23)(H,25,26)
Reactome pathway
US Patent
n/an/a<100n/an/an/an/an/an/a
CELGENE QUANTICEL RESEARCH, INC.
US Patent
Assay Description
The enzymatic assay of Jarid1A activity is based upon Time Resolved-Fluorescence Resonance Energy Transfer (TR-FRET) detection. The ability of test c...
US Patent US9617242 (2017)
BindingDB Entry DOI: 10.7270/Q2XK8HM5
Lysine-specific demethylase 4C
(Homo sapiens (Human))
BDBM277738
(3-{[5-chloro-1-(3,3,3-trifluoropropyl)-1H-indazol-...)
Show SMILES OC(=O)c1ccncc1Nc1nn(CCC(F)(F)F)c2ccc(Cl)cc12
Show InChI InChI=1S/C16H12ClF3N4O2/c17-9-1-2-13-11(7-9)14(23-24(13)6-4-16(18,19)20)22-12-8-21-5-3-10(12)15(25)26/h1-3,5,7-8H,4,6H2,(H,22,23)(H,25,26)
US Patent
n/an/a 550n/an/an/an/an/an/a
Celgene Quanticel Research Inc
US Patent
Assay Description
The ability of test compounds to inhibit the activity of JMJD2C was determined in 384-well plate format under the following reaction conditions: 0.3 ...
US Patent US10336727 (2019)
BindingDB Entry DOI: 10.7270/Q2571FBT
Lysine-specific demethylase 4C
(Homo sapiens (Human))
BDBM277738
(3-{[5-chloro-1-(3,3,3-trifluoropropyl)-1H-indazol-...)
Show SMILES OC(=O)c1ccncc1Nc1nn(CCC(F)(F)F)c2ccc(Cl)cc12
Show InChI InChI=1S/C16H12ClF3N4O2/c17-9-1-2-13-11(7-9)14(23-24(13)6-4-16(18,19)20)22-12-8-21-5-3-10(12)15(25)26/h1-3,5,7-8H,4,6H2,(H,22,23)(H,25,26)
US Patent
n/an/a 550n/an/an/an/an/an/a
CELGENE QUANTICEL RESEARCH, INC.
US Patent
Assay Description
The ability of test compounds to inhibit the activity of JMJD2C was determined in 384-well plate format under the following reaction conditions: 0.3 ...
US Patent US9617242 (2017)
BindingDB Entry DOI: 10.7270/Q2XK8HM5
Lysine-specific demethylase 5A
(Homo sapiens (Human))
BDBM277738
(3-{[5-chloro-1-(3,3,3-trifluoropropyl)-1H-indazol-...)
Show SMILES OC(=O)c1ccncc1Nc1nn(CCC(F)(F)F)c2ccc(Cl)cc12
Show InChI InChI=1S/C16H12ClF3N4O2/c17-9-1-2-13-11(7-9)14(23-24(13)6-4-16(18,19)20)22-12-8-21-5-3-10(12)15(25)26/h1-3,5,7-8H,4,6H2,(H,22,23)(H,25,26)
Reactome pathway
US Patent
n/an/a<100n/an/an/an/an/an/a
Celgene Quanticel Research Inc
US Patent
Assay Description
The enzymatic assay of Jarid1A activity is based upon Time Resolved-Fluorescence Resonance Energy Transfer (TR-FRET) detection. The ability of test c...
US Patent US10336727 (2019)
BindingDB Entry DOI: 10.7270/Q2571FBT
Lysine-specific demethylase 5B
(Homo sapiens (Human))
BDBM277738
(3-{[5-chloro-1-(3,3,3-trifluoropropyl)-1H-indazol-...)
Show SMILES OC(=O)c1ccncc1Nc1nn(CCC(F)(F)F)c2ccc(Cl)cc12
Show InChI InChI=1S/C16H12ClF3N4O2/c17-9-1-2-13-11(7-9)14(23-24(13)6-4-16(18,19)20)22-12-8-21-5-3-10(12)15(25)26/h1-3,5,7-8H,4,6H2,(H,22,23)(H,25,26)
US Patent
n/an/a<100n/an/an/an/an/an/a
Celgene Quanticel Research Inc
US Patent
Assay Description
The ability of test compounds to inhibit the activity of Jarid1B was determined in 384-well plate format under the following reaction conditions: 0.8...
US Patent US10336727 (2019)
BindingDB Entry DOI: 10.7270/Q2571FBT
Lysine-specific demethylase 5B
(Homo sapiens (Human))
BDBM277738
(3-{[5-chloro-1-(3,3,3-trifluoropropyl)-1H-indazol-...)
Show SMILES OC(=O)c1ccncc1Nc1nn(CCC(F)(F)F)c2ccc(Cl)cc12
Show InChI InChI=1S/C16H12ClF3N4O2/c17-9-1-2-13-11(7-9)14(23-24(13)6-4-16(18,19)20)22-12-8-21-5-3-10(12)15(25)26/h1-3,5,7-8H,4,6H2,(H,22,23)(H,25,26)
US Patent
n/an/a<100n/an/an/an/an/an/a
CELGENE QUANTICEL RESEARCH, INC.
US Patent
Assay Description
The ability of test compounds to inhibit the activity of Jarid1B was determined in 384-well plate format under the following reaction conditions: 0.8...
US Patent US9617242 (2017)
BindingDB Entry DOI: 10.7270/Q2XK8HM5