BDBM277749 3-({5-fluoro-1-[5-(methylamino)pentyl]-1H-indazol-3-yl}amino)pyridine-4-carboxylic acid, trifluoroacetic acid salt::US10040779, Example 46::US10336727, Example 46::US9617242, Example 46
SMILES: CNCCCCCn1nc(Nc2cnccc2C(O)=O)c2cc(Cl)ccc12
InChI Key: InChIKey=SZRHCHHPOFLIEC-UHFFFAOYSA-N
Data: 9 IC50
Activity Spreadsheet -- Enzyme Inhibition Constant Data from BindingDB
Found 9 hits for monomerid = 277749
Trg + Lig
Ki
nM
ΔG°
kcal/mole
IC50
nM
Kd
nM
EC50/IC50
nM
koff
s-1
kon
M-1s-1
pHTemp
°C
Lysine-specific demethylase 5A
(Homo sapiens (Human))
BDBM277749
(3-({5-fluoro-1-[5-(methylamino)pentyl]-1H-indazol-...)
Show SMILES CNCCCCCn1nc(Nc2cnccc2C(O)=O)c2cc(Cl)ccc12
Show InChI InChI=1S/C19H22ClN5O2/c1-21-8-3-2-4-10-25-17-6-5-13(20)11-15(17)18(24-25)23-16-12-22-9-7-14(16)19(26)27/h5-7,9,11-12,21H,2-4,8,10H2,1H3,(H,23,24)(H,26,27)
Reactome pathway
US Patent
n/an/a<0.100n/an/an/an/an/an/a
Celgene Quanticel Research, Inc.
US Patent
Assay Description
The enzymatic assay of Jarid1A activity is based upon Time Resolved-Fluorescence Resonance Energy Transfer (TR-FRET) detection. The ability of test c...
US Patent US10040779 (2018)
BindingDB Entry DOI: 10.7270/Q26H4KF1
Lysine-specific demethylase 5B
(Homo sapiens (Human))
BDBM277749
(3-({5-fluoro-1-[5-(methylamino)pentyl]-1H-indazol-...)
Show SMILES CNCCCCCn1nc(Nc2cnccc2C(O)=O)c2cc(Cl)ccc12
Show InChI InChI=1S/C19H22ClN5O2/c1-21-8-3-2-4-10-25-17-6-5-13(20)11-15(17)18(24-25)23-16-12-22-9-7-14(16)19(26)27/h5-7,9,11-12,21H,2-4,8,10H2,1H3,(H,23,24)(H,26,27)
US Patent
n/an/a<0.100n/an/an/an/an/an/a
Celgene Quanticel Research, Inc.
US Patent
Assay Description
The ability of test compounds to inhibit the activity of Jarid1B was determined in 384-well plate format under the following reaction conditions: 0.8...
US Patent US10040779 (2018)
BindingDB Entry DOI: 10.7270/Q26H4KF1
Lysine-specific demethylase 4C
(Homo sapiens (Human))
BDBM277749
(3-({5-fluoro-1-[5-(methylamino)pentyl]-1H-indazol-...)
Show SMILES CNCCCCCn1nc(Nc2cnccc2C(O)=O)c2cc(Cl)ccc12
Show InChI InChI=1S/C19H22ClN5O2/c1-21-8-3-2-4-10-25-17-6-5-13(20)11-15(17)18(24-25)23-16-12-22-9-7-14(16)19(26)27/h5-7,9,11-12,21H,2-4,8,10H2,1H3,(H,23,24)(H,26,27)
US Patent
n/an/a<0.100n/an/an/an/an/an/a
Celgene Quanticel Research, Inc.
US Patent
Assay Description
The ability of test compounds to inhibit the activity of JMJD2C was determined in 384-well plate format under the following reaction conditions: 0.3 ...
US Patent US10040779 (2018)
BindingDB Entry DOI: 10.7270/Q26H4KF1
Lysine-specific demethylase 5A
(Homo sapiens (Human))
BDBM277749
(3-({5-fluoro-1-[5-(methylamino)pentyl]-1H-indazol-...)
Show SMILES CNCCCCCn1nc(Nc2cnccc2C(O)=O)c2cc(Cl)ccc12
Show InChI InChI=1S/C19H22ClN5O2/c1-21-8-3-2-4-10-25-17-6-5-13(20)11-15(17)18(24-25)23-16-12-22-9-7-14(16)19(26)27/h5-7,9,11-12,21H,2-4,8,10H2,1H3,(H,23,24)(H,26,27)
Reactome pathway
US Patent
n/an/a<100n/an/an/an/an/an/a
CELGENE QUANTICEL RESEARCH, INC.
US Patent
Assay Description
The enzymatic assay of Jarid1A activity is based upon Time Resolved-Fluorescence Resonance Energy Transfer (TR-FRET) detection. The ability of test c...
US Patent US9617242 (2017)
BindingDB Entry DOI: 10.7270/Q2XK8HM5
Lysine-specific demethylase 4C
(Homo sapiens (Human))
BDBM277749
(3-({5-fluoro-1-[5-(methylamino)pentyl]-1H-indazol-...)
Show SMILES CNCCCCCn1nc(Nc2cnccc2C(O)=O)c2cc(Cl)ccc12
Show InChI InChI=1S/C19H22ClN5O2/c1-21-8-3-2-4-10-25-17-6-5-13(20)11-15(17)18(24-25)23-16-12-22-9-7-14(16)19(26)27/h5-7,9,11-12,21H,2-4,8,10H2,1H3,(H,23,24)(H,26,27)
US Patent
n/an/a<100n/an/an/an/an/an/a
Celgene Quanticel Research Inc
US Patent
Assay Description
The ability of test compounds to inhibit the activity of JMJD2C was determined in 384-well plate format under the following reaction conditions: 0.3 ...
US Patent US10336727 (2019)
BindingDB Entry DOI: 10.7270/Q2571FBT
Lysine-specific demethylase 4C
(Homo sapiens (Human))
BDBM277749
(3-({5-fluoro-1-[5-(methylamino)pentyl]-1H-indazol-...)
Show SMILES CNCCCCCn1nc(Nc2cnccc2C(O)=O)c2cc(Cl)ccc12
Show InChI InChI=1S/C19H22ClN5O2/c1-21-8-3-2-4-10-25-17-6-5-13(20)11-15(17)18(24-25)23-16-12-22-9-7-14(16)19(26)27/h5-7,9,11-12,21H,2-4,8,10H2,1H3,(H,23,24)(H,26,27)
US Patent
n/an/a<100n/an/an/an/an/an/a
CELGENE QUANTICEL RESEARCH, INC.
US Patent
Assay Description
The ability of test compounds to inhibit the activity of JMJD2C was determined in 384-well plate format under the following reaction conditions: 0.3 ...
US Patent US9617242 (2017)
BindingDB Entry DOI: 10.7270/Q2XK8HM5
Lysine-specific demethylase 5A
(Homo sapiens (Human))
BDBM277749
(3-({5-fluoro-1-[5-(methylamino)pentyl]-1H-indazol-...)
Show SMILES CNCCCCCn1nc(Nc2cnccc2C(O)=O)c2cc(Cl)ccc12
Show InChI InChI=1S/C19H22ClN5O2/c1-21-8-3-2-4-10-25-17-6-5-13(20)11-15(17)18(24-25)23-16-12-22-9-7-14(16)19(26)27/h5-7,9,11-12,21H,2-4,8,10H2,1H3,(H,23,24)(H,26,27)
Reactome pathway
US Patent
n/an/a<100n/an/an/an/an/an/a
Celgene Quanticel Research Inc
US Patent
Assay Description
The enzymatic assay of Jarid1A activity is based upon Time Resolved-Fluorescence Resonance Energy Transfer (TR-FRET) detection. The ability of test c...
US Patent US10336727 (2019)
BindingDB Entry DOI: 10.7270/Q2571FBT
Lysine-specific demethylase 5B
(Homo sapiens (Human))
BDBM277749
(3-({5-fluoro-1-[5-(methylamino)pentyl]-1H-indazol-...)
Show SMILES CNCCCCCn1nc(Nc2cnccc2C(O)=O)c2cc(Cl)ccc12
Show InChI InChI=1S/C19H22ClN5O2/c1-21-8-3-2-4-10-25-17-6-5-13(20)11-15(17)18(24-25)23-16-12-22-9-7-14(16)19(26)27/h5-7,9,11-12,21H,2-4,8,10H2,1H3,(H,23,24)(H,26,27)
US Patent
n/an/a<100n/an/an/an/an/an/a
Celgene Quanticel Research Inc
US Patent
Assay Description
The ability of test compounds to inhibit the activity of Jarid1B was determined in 384-well plate format under the following reaction conditions: 0.8...
US Patent US10336727 (2019)
BindingDB Entry DOI: 10.7270/Q2571FBT
Lysine-specific demethylase 5B
(Homo sapiens (Human))
BDBM277749
(3-({5-fluoro-1-[5-(methylamino)pentyl]-1H-indazol-...)
Show SMILES CNCCCCCn1nc(Nc2cnccc2C(O)=O)c2cc(Cl)ccc12
Show InChI InChI=1S/C19H22ClN5O2/c1-21-8-3-2-4-10-25-17-6-5-13(20)11-15(17)18(24-25)23-16-12-22-9-7-14(16)19(26)27/h5-7,9,11-12,21H,2-4,8,10H2,1H3,(H,23,24)(H,26,27)
US Patent
n/an/a<100n/an/an/an/an/an/a
CELGENE QUANTICEL RESEARCH, INC.
US Patent
Assay Description
The ability of test compounds to inhibit the activity of Jarid1B was determined in 384-well plate format under the following reaction conditions: 0.8...
US Patent US9617242 (2017)
BindingDB Entry DOI: 10.7270/Q2XK8HM5