BDBM277758 3-{[5-fluoro-1-(3,3,3-trifluoro-2-hydroxypropyl)-1H-indazol-3-yl]amino}pyridine-4-carboxylic acid::US10040779, Example 55::US10336727, Example 55::US9617242, Example 55
SMILES: OC(Cn1nc(Nc2cnccc2C(O)=O)c2cc(F)ccc12)C(F)(F)F
InChI Key: InChIKey=NJPHSBFEDZSMAZ-UHFFFAOYSA-N
Data: 9 IC50
Activity Spreadsheet -- Enzyme Inhibition Constant Data from BindingDB
Found 9 hits for monomerid = 277758
Trg + Lig
Ki
nM
ΔG°
kcal/mole
IC50
nM
Kd
nM
EC50/IC50
nM
koff
s-1
kon
M-1s-1
pHTemp
°C
Lysine-specific demethylase 5A
(Homo sapiens (Human))
BDBM277758
(3-{[5-fluoro-1-(3,3,3-trifluoro-2-hydroxypropyl)-1...)
Show SMILES OC(Cn1nc(Nc2cnccc2C(O)=O)c2cc(F)ccc12)C(F)(F)F
Show InChI InChI=1S/C16H12F4N4O3/c17-8-1-2-12-10(5-8)14(23-24(12)7-13(25)16(18,19)20)22-11-6-21-4-3-9(11)15(26)27/h1-6,13,25H,7H2,(H,22,23)(H,26,27)
Reactome pathway
US Patent
n/an/a<0.100n/an/an/an/an/an/a
Celgene Quanticel Research, Inc.
US Patent
Assay Description
The enzymatic assay of Jarid1A activity is based upon Time Resolved-Fluorescence Resonance Energy Transfer (TR-FRET) detection. The ability of test c...
US Patent US10040779 (2018)
BindingDB Entry DOI: 10.7270/Q26H4KF1
Lysine-specific demethylase 5B
(Homo sapiens (Human))
BDBM277758
(3-{[5-fluoro-1-(3,3,3-trifluoro-2-hydroxypropyl)-1...)
Show SMILES OC(Cn1nc(Nc2cnccc2C(O)=O)c2cc(F)ccc12)C(F)(F)F
Show InChI InChI=1S/C16H12F4N4O3/c17-8-1-2-12-10(5-8)14(23-24(12)7-13(25)16(18,19)20)22-11-6-21-4-3-9(11)15(26)27/h1-6,13,25H,7H2,(H,22,23)(H,26,27)
US Patent
n/an/a<0.100n/an/an/an/an/an/a
Celgene Quanticel Research, Inc.
US Patent
Assay Description
The ability of test compounds to inhibit the activity of Jarid1B was determined in 384-well plate format under the following reaction conditions: 0.8...
US Patent US10040779 (2018)
BindingDB Entry DOI: 10.7270/Q26H4KF1
Lysine-specific demethylase 4C
(Homo sapiens (Human))
BDBM277758
(3-{[5-fluoro-1-(3,3,3-trifluoro-2-hydroxypropyl)-1...)
Show SMILES OC(Cn1nc(Nc2cnccc2C(O)=O)c2cc(F)ccc12)C(F)(F)F
Show InChI InChI=1S/C16H12F4N4O3/c17-8-1-2-12-10(5-8)14(23-24(12)7-13(25)16(18,19)20)22-11-6-21-4-3-9(11)15(26)27/h1-6,13,25H,7H2,(H,22,23)(H,26,27)
US Patent
n/an/a<0.100n/an/an/an/an/an/a
Celgene Quanticel Research, Inc.
US Patent
Assay Description
The ability of test compounds to inhibit the activity of JMJD2C was determined in 384-well plate format under the following reaction conditions: 0.3 ...
US Patent US10040779 (2018)
BindingDB Entry DOI: 10.7270/Q26H4KF1
Lysine-specific demethylase 5A
(Homo sapiens (Human))
BDBM277758
(3-{[5-fluoro-1-(3,3,3-trifluoro-2-hydroxypropyl)-1...)
Show SMILES OC(Cn1nc(Nc2cnccc2C(O)=O)c2cc(F)ccc12)C(F)(F)F
Show InChI InChI=1S/C16H12F4N4O3/c17-8-1-2-12-10(5-8)14(23-24(12)7-13(25)16(18,19)20)22-11-6-21-4-3-9(11)15(26)27/h1-6,13,25H,7H2,(H,22,23)(H,26,27)
Reactome pathway
US Patent
n/an/a<100n/an/an/an/an/an/a
CELGENE QUANTICEL RESEARCH, INC.
US Patent
Assay Description
The enzymatic assay of Jarid1A activity is based upon Time Resolved-Fluorescence Resonance Energy Transfer (TR-FRET) detection. The ability of test c...
US Patent US9617242 (2017)
BindingDB Entry DOI: 10.7270/Q2XK8HM5
Lysine-specific demethylase 4C
(Homo sapiens (Human))
BDBM277758
(3-{[5-fluoro-1-(3,3,3-trifluoro-2-hydroxypropyl)-1...)
Show SMILES OC(Cn1nc(Nc2cnccc2C(O)=O)c2cc(F)ccc12)C(F)(F)F
Show InChI InChI=1S/C16H12F4N4O3/c17-8-1-2-12-10(5-8)14(23-24(12)7-13(25)16(18,19)20)22-11-6-21-4-3-9(11)15(26)27/h1-6,13,25H,7H2,(H,22,23)(H,26,27)
US Patent
n/an/a<100n/an/an/an/an/an/a
Celgene Quanticel Research Inc
US Patent
Assay Description
The ability of test compounds to inhibit the activity of JMJD2C was determined in 384-well plate format under the following reaction conditions: 0.3 ...
US Patent US10336727 (2019)
BindingDB Entry DOI: 10.7270/Q2571FBT
Lysine-specific demethylase 4C
(Homo sapiens (Human))
BDBM277758
(3-{[5-fluoro-1-(3,3,3-trifluoro-2-hydroxypropyl)-1...)
Show SMILES OC(Cn1nc(Nc2cnccc2C(O)=O)c2cc(F)ccc12)C(F)(F)F
Show InChI InChI=1S/C16H12F4N4O3/c17-8-1-2-12-10(5-8)14(23-24(12)7-13(25)16(18,19)20)22-11-6-21-4-3-9(11)15(26)27/h1-6,13,25H,7H2,(H,22,23)(H,26,27)
US Patent
n/an/a<100n/an/an/an/an/an/a
CELGENE QUANTICEL RESEARCH, INC.
US Patent
Assay Description
The ability of test compounds to inhibit the activity of JMJD2C was determined in 384-well plate format under the following reaction conditions: 0.3 ...
US Patent US9617242 (2017)
BindingDB Entry DOI: 10.7270/Q2XK8HM5
Lysine-specific demethylase 5A
(Homo sapiens (Human))
BDBM277758
(3-{[5-fluoro-1-(3,3,3-trifluoro-2-hydroxypropyl)-1...)
Show SMILES OC(Cn1nc(Nc2cnccc2C(O)=O)c2cc(F)ccc12)C(F)(F)F
Show InChI InChI=1S/C16H12F4N4O3/c17-8-1-2-12-10(5-8)14(23-24(12)7-13(25)16(18,19)20)22-11-6-21-4-3-9(11)15(26)27/h1-6,13,25H,7H2,(H,22,23)(H,26,27)
Reactome pathway
US Patent
n/an/a<100n/an/an/an/an/an/a
Celgene Quanticel Research Inc
US Patent
Assay Description
The enzymatic assay of Jarid1A activity is based upon Time Resolved-Fluorescence Resonance Energy Transfer (TR-FRET) detection. The ability of test c...
US Patent US10336727 (2019)
BindingDB Entry DOI: 10.7270/Q2571FBT
Lysine-specific demethylase 5B
(Homo sapiens (Human))
BDBM277758
(3-{[5-fluoro-1-(3,3,3-trifluoro-2-hydroxypropyl)-1...)
Show SMILES OC(Cn1nc(Nc2cnccc2C(O)=O)c2cc(F)ccc12)C(F)(F)F
Show InChI InChI=1S/C16H12F4N4O3/c17-8-1-2-12-10(5-8)14(23-24(12)7-13(25)16(18,19)20)22-11-6-21-4-3-9(11)15(26)27/h1-6,13,25H,7H2,(H,22,23)(H,26,27)
US Patent
n/an/a<100n/an/an/an/an/an/a
Celgene Quanticel Research Inc
US Patent
Assay Description
The ability of test compounds to inhibit the activity of Jarid1B was determined in 384-well plate format under the following reaction conditions: 0.8...
US Patent US10336727 (2019)
BindingDB Entry DOI: 10.7270/Q2571FBT
Lysine-specific demethylase 5B
(Homo sapiens (Human))
BDBM277758
(3-{[5-fluoro-1-(3,3,3-trifluoro-2-hydroxypropyl)-1...)
Show SMILES OC(Cn1nc(Nc2cnccc2C(O)=O)c2cc(F)ccc12)C(F)(F)F
Show InChI InChI=1S/C16H12F4N4O3/c17-8-1-2-12-10(5-8)14(23-24(12)7-13(25)16(18,19)20)22-11-6-21-4-3-9(11)15(26)27/h1-6,13,25H,7H2,(H,22,23)(H,26,27)
US Patent
n/an/a<100n/an/an/an/an/an/a
CELGENE QUANTICEL RESEARCH, INC.
US Patent
Assay Description
The ability of test compounds to inhibit the activity of Jarid1B was determined in 384-well plate format under the following reaction conditions: 0.8...
US Patent US9617242 (2017)
BindingDB Entry DOI: 10.7270/Q2XK8HM5