null
SMILES: CCCn1cc(Nc2cnccc2C(O)=O)c2cc(F)ccc12
InChI Key: InChIKey=FDILHQJCFKWROO-UHFFFAOYSA-N
Activity Spreadsheet -- Enzyme Inhibition Constant Data from BindingDB
Found 6 hits for monomerid = 277760
Trg + Lig
Ki
nM
ΔG°
kcal/mole
IC50
nM
Kd
nM
EC50/IC50
nM
koff
s-1
kon
M-1s-1
pHTemp
°C
Lysine-specific demethylase 5A
(Homo sapiens (Human))
BDBM277760
(3-[(5-fluoro-1-propyl-1H-indol-3-yl)amino]pyridine...)
Show SMILES CCCn1cc(Nc2cnccc2C(O)=O)c2cc(F)ccc12
Show InChI InChI=1S/C17H16FN3O2/c1-2-7-21-10-15(13-8-11(18)3-4-16(13)21)20-14-9-19-6-5-12(14)17(22)23/h3-6,8-10,20H,2,7H2,1H3,(H,22,23)
Reactome pathway
US Patent
n/an/a<0.100n/an/an/an/an/an/a
Celgene Quanticel Research, Inc.
US Patent
Assay Description
The enzymatic assay of Jarid1A activity is based upon Time Resolved-Fluorescence Resonance Energy Transfer (TR-FRET) detection. The ability of test c...
US Patent US10040779 (2018)
BindingDB Entry DOI: 10.7270/Q26H4KF1
Lysine-specific demethylase 5B
(Homo sapiens (Human))
BDBM277760
(3-[(5-fluoro-1-propyl-1H-indol-3-yl)amino]pyridine...)
Show SMILES CCCn1cc(Nc2cnccc2C(O)=O)c2cc(F)ccc12
Show InChI InChI=1S/C17H16FN3O2/c1-2-7-21-10-15(13-8-11(18)3-4-16(13)21)20-14-9-19-6-5-12(14)17(22)23/h3-6,8-10,20H,2,7H2,1H3,(H,22,23)
US Patent
n/an/a<0.100n/an/an/an/an/an/a
Celgene Quanticel Research, Inc.
US Patent
Assay Description
The ability of test compounds to inhibit the activity of Jarid1B was determined in 384-well plate format under the following reaction conditions: 0.8...
US Patent US10040779 (2018)
BindingDB Entry DOI: 10.7270/Q26H4KF1
Lysine-specific demethylase 4C
(Homo sapiens (Human))
BDBM277760
(3-[(5-fluoro-1-propyl-1H-indol-3-yl)amino]pyridine...)
Show SMILES CCCn1cc(Nc2cnccc2C(O)=O)c2cc(F)ccc12
Show InChI InChI=1S/C17H16FN3O2/c1-2-7-21-10-15(13-8-11(18)3-4-16(13)21)20-14-9-19-6-5-12(14)17(22)23/h3-6,8-10,20H,2,7H2,1H3,(H,22,23)
US Patent
n/an/a 550n/an/an/an/an/an/a
Celgene Quanticel Research Inc
US Patent
Assay Description
The ability of test compounds to inhibit the activity of JMJD2C was determined in 384-well plate format under the following reaction conditions: 0.3 ...
US Patent US10336727 (2019)
BindingDB Entry DOI: 10.7270/Q2571FBT
Lysine-specific demethylase 5A
(Homo sapiens (Human))
BDBM277760
(3-[(5-fluoro-1-propyl-1H-indol-3-yl)amino]pyridine...)
Show SMILES CCCn1cc(Nc2cnccc2C(O)=O)c2cc(F)ccc12
Show InChI InChI=1S/C17H16FN3O2/c1-2-7-21-10-15(13-8-11(18)3-4-16(13)21)20-14-9-19-6-5-12(14)17(22)23/h3-6,8-10,20H,2,7H2,1H3,(H,22,23)
Reactome pathway
US Patent
n/an/a<100n/an/an/an/an/an/a
Celgene Quanticel Research Inc
US Patent
Assay Description
The enzymatic assay of Jarid1A activity is based upon Time Resolved-Fluorescence Resonance Energy Transfer (TR-FRET) detection. The ability of test c...
US Patent US10336727 (2019)
BindingDB Entry DOI: 10.7270/Q2571FBT
Lysine-specific demethylase 5B
(Homo sapiens (Human))
BDBM277760
(3-[(5-fluoro-1-propyl-1H-indol-3-yl)amino]pyridine...)
Show SMILES CCCn1cc(Nc2cnccc2C(O)=O)c2cc(F)ccc12
Show InChI InChI=1S/C17H16FN3O2/c1-2-7-21-10-15(13-8-11(18)3-4-16(13)21)20-14-9-19-6-5-12(14)17(22)23/h3-6,8-10,20H,2,7H2,1H3,(H,22,23)
US Patent
n/an/a<100n/an/an/an/an/an/a
Celgene Quanticel Research Inc
US Patent
Assay Description
The ability of test compounds to inhibit the activity of Jarid1B was determined in 384-well plate format under the following reaction conditions: 0.8...
US Patent US10336727 (2019)
BindingDB Entry DOI: 10.7270/Q2571FBT
Lysine-specific demethylase 4C
(Homo sapiens (Human))
BDBM277760
(3-[(5-fluoro-1-propyl-1H-indol-3-yl)amino]pyridine...)
Show SMILES CCCn1cc(Nc2cnccc2C(O)=O)c2cc(F)ccc12
Show InChI InChI=1S/C17H16FN3O2/c1-2-7-21-10-15(13-8-11(18)3-4-16(13)21)20-14-9-19-6-5-12(14)17(22)23/h3-6,8-10,20H,2,7H2,1H3,(H,22,23)
US Patent
n/an/a 0.550n/an/an/an/an/an/a
Celgene Quanticel Research, Inc.
US Patent
Assay Description
The ability of test compounds to inhibit the activity of JMJD2C was determined in 384-well plate format under the following reaction conditions: 0.3 ...
US Patent US10040779 (2018)
BindingDB Entry DOI: 10.7270/Q26H4KF1