BDBM277770 3-({5-fluoro-1-[(3R)-tetrahydrofuran-3-yl]-1H-indazol-3-yl}amino)pyridine-4-carboxylic acid::US10040779, Example 67::US10336727, Example 67::US9617242, Example 67
SMILES: OC(=O)c1ccncc1Nc1nn([C@@H]2CCOC2)c2ccc(F)cc12
InChI Key: InChIKey=CLACBXJUUICJKS-LLVKDONJSA-N
Data: 9 IC50
Activity Spreadsheet -- Enzyme Inhibition Constant Data from BindingDB
Found 9 hits for monomerid = 277770
Trg + Lig
Ki
nM
ΔG°
kcal/mole
IC50
nM
Kd
nM
EC50/IC50
nM
koff
s-1
kon
M-1s-1
pHTemp
°C
Lysine-specific demethylase 5A
(Homo sapiens (Human))
BDBM277770
(3-({5-fluoro-1-[(3R)-tetrahydrofuran-3-yl]-1H-inda...)
Show SMILES OC(=O)c1ccncc1Nc1nn([C@@H]2CCOC2)c2ccc(F)cc12 |r|
Show InChI InChI=1S/C17H15FN4O3/c18-10-1-2-15-13(7-10)16(21-22(15)11-4-6-25-9-11)20-14-8-19-5-3-12(14)17(23)24/h1-3,5,7-8,11H,4,6,9H2,(H,20,21)(H,23,24)/t11-/m1/s1
Reactome pathway
US Patent
n/an/a<0.100n/an/an/an/an/an/a
Celgene Quanticel Research, Inc.
US Patent
Assay Description
The enzymatic assay of Jarid1A activity is based upon Time Resolved-Fluorescence Resonance Energy Transfer (TR-FRET) detection. The ability of test c...
US Patent US10040779 (2018)
BindingDB Entry DOI: 10.7270/Q26H4KF1
Lysine-specific demethylase 5B
(Homo sapiens (Human))
BDBM277770
(3-({5-fluoro-1-[(3R)-tetrahydrofuran-3-yl]-1H-inda...)
Show SMILES OC(=O)c1ccncc1Nc1nn([C@@H]2CCOC2)c2ccc(F)cc12 |r|
Show InChI InChI=1S/C17H15FN4O3/c18-10-1-2-15-13(7-10)16(21-22(15)11-4-6-25-9-11)20-14-8-19-5-3-12(14)17(23)24/h1-3,5,7-8,11H,4,6,9H2,(H,20,21)(H,23,24)/t11-/m1/s1
US Patent
n/an/a<0.100n/an/an/an/an/an/a
Celgene Quanticel Research, Inc.
US Patent
Assay Description
The ability of test compounds to inhibit the activity of Jarid1B was determined in 384-well plate format under the following reaction conditions: 0.8...
US Patent US10040779 (2018)
BindingDB Entry DOI: 10.7270/Q26H4KF1
Lysine-specific demethylase 4C
(Homo sapiens (Human))
BDBM277770
(3-({5-fluoro-1-[(3R)-tetrahydrofuran-3-yl]-1H-inda...)
Show SMILES OC(=O)c1ccncc1Nc1nn([C@@H]2CCOC2)c2ccc(F)cc12 |r|
Show InChI InChI=1S/C17H15FN4O3/c18-10-1-2-15-13(7-10)16(21-22(15)11-4-6-25-9-11)20-14-8-19-5-3-12(14)17(23)24/h1-3,5,7-8,11H,4,6,9H2,(H,20,21)(H,23,24)/t11-/m1/s1
US Patent
n/an/a<0.100n/an/an/an/an/an/a
Celgene Quanticel Research, Inc.
US Patent
Assay Description
The ability of test compounds to inhibit the activity of JMJD2C was determined in 384-well plate format under the following reaction conditions: 0.3 ...
US Patent US10040779 (2018)
BindingDB Entry DOI: 10.7270/Q26H4KF1
Lysine-specific demethylase 5A
(Homo sapiens (Human))
BDBM277770
(3-({5-fluoro-1-[(3R)-tetrahydrofuran-3-yl]-1H-inda...)
Show SMILES OC(=O)c1ccncc1Nc1nn([C@@H]2CCOC2)c2ccc(F)cc12 |r|
Show InChI InChI=1S/C17H15FN4O3/c18-10-1-2-15-13(7-10)16(21-22(15)11-4-6-25-9-11)20-14-8-19-5-3-12(14)17(23)24/h1-3,5,7-8,11H,4,6,9H2,(H,20,21)(H,23,24)/t11-/m1/s1
Reactome pathway
US Patent
n/an/a<100n/an/an/an/an/an/a
CELGENE QUANTICEL RESEARCH, INC.
US Patent
Assay Description
The enzymatic assay of Jarid1A activity is based upon Time Resolved-Fluorescence Resonance Energy Transfer (TR-FRET) detection. The ability of test c...
US Patent US9617242 (2017)
BindingDB Entry DOI: 10.7270/Q2XK8HM5
Lysine-specific demethylase 4C
(Homo sapiens (Human))
BDBM277770
(3-({5-fluoro-1-[(3R)-tetrahydrofuran-3-yl]-1H-inda...)
Show SMILES OC(=O)c1ccncc1Nc1nn([C@@H]2CCOC2)c2ccc(F)cc12 |r|
Show InChI InChI=1S/C17H15FN4O3/c18-10-1-2-15-13(7-10)16(21-22(15)11-4-6-25-9-11)20-14-8-19-5-3-12(14)17(23)24/h1-3,5,7-8,11H,4,6,9H2,(H,20,21)(H,23,24)/t11-/m1/s1
US Patent
n/an/a<100n/an/an/an/an/an/a
Celgene Quanticel Research Inc
US Patent
Assay Description
The ability of test compounds to inhibit the activity of JMJD2C was determined in 384-well plate format under the following reaction conditions: 0.3 ...
US Patent US10336727 (2019)
BindingDB Entry DOI: 10.7270/Q2571FBT
Lysine-specific demethylase 4C
(Homo sapiens (Human))
BDBM277770
(3-({5-fluoro-1-[(3R)-tetrahydrofuran-3-yl]-1H-inda...)
Show SMILES OC(=O)c1ccncc1Nc1nn([C@@H]2CCOC2)c2ccc(F)cc12 |r|
Show InChI InChI=1S/C17H15FN4O3/c18-10-1-2-15-13(7-10)16(21-22(15)11-4-6-25-9-11)20-14-8-19-5-3-12(14)17(23)24/h1-3,5,7-8,11H,4,6,9H2,(H,20,21)(H,23,24)/t11-/m1/s1
US Patent
n/an/a<100n/an/an/an/an/an/a
CELGENE QUANTICEL RESEARCH, INC.
US Patent
Assay Description
The ability of test compounds to inhibit the activity of JMJD2C was determined in 384-well plate format under the following reaction conditions: 0.3 ...
US Patent US9617242 (2017)
BindingDB Entry DOI: 10.7270/Q2XK8HM5
Lysine-specific demethylase 5A
(Homo sapiens (Human))
BDBM277770
(3-({5-fluoro-1-[(3R)-tetrahydrofuran-3-yl]-1H-inda...)
Show SMILES OC(=O)c1ccncc1Nc1nn([C@@H]2CCOC2)c2ccc(F)cc12 |r|
Show InChI InChI=1S/C17H15FN4O3/c18-10-1-2-15-13(7-10)16(21-22(15)11-4-6-25-9-11)20-14-8-19-5-3-12(14)17(23)24/h1-3,5,7-8,11H,4,6,9H2,(H,20,21)(H,23,24)/t11-/m1/s1
Reactome pathway
US Patent
n/an/a<100n/an/an/an/an/an/a
Celgene Quanticel Research Inc
US Patent
Assay Description
The enzymatic assay of Jarid1A activity is based upon Time Resolved-Fluorescence Resonance Energy Transfer (TR-FRET) detection. The ability of test c...
US Patent US10336727 (2019)
BindingDB Entry DOI: 10.7270/Q2571FBT
Lysine-specific demethylase 5B
(Homo sapiens (Human))
BDBM277770
(3-({5-fluoro-1-[(3R)-tetrahydrofuran-3-yl]-1H-inda...)
Show SMILES OC(=O)c1ccncc1Nc1nn([C@@H]2CCOC2)c2ccc(F)cc12 |r|
Show InChI InChI=1S/C17H15FN4O3/c18-10-1-2-15-13(7-10)16(21-22(15)11-4-6-25-9-11)20-14-8-19-5-3-12(14)17(23)24/h1-3,5,7-8,11H,4,6,9H2,(H,20,21)(H,23,24)/t11-/m1/s1
US Patent
n/an/a<100n/an/an/an/an/an/a
Celgene Quanticel Research Inc
US Patent
Assay Description
The ability of test compounds to inhibit the activity of Jarid1B was determined in 384-well plate format under the following reaction conditions: 0.8...
US Patent US10336727 (2019)
BindingDB Entry DOI: 10.7270/Q2571FBT
Lysine-specific demethylase 5B
(Homo sapiens (Human))
BDBM277770
(3-({5-fluoro-1-[(3R)-tetrahydrofuran-3-yl]-1H-inda...)
Show SMILES OC(=O)c1ccncc1Nc1nn([C@@H]2CCOC2)c2ccc(F)cc12 |r|
Show InChI InChI=1S/C17H15FN4O3/c18-10-1-2-15-13(7-10)16(21-22(15)11-4-6-25-9-11)20-14-8-19-5-3-12(14)17(23)24/h1-3,5,7-8,11H,4,6,9H2,(H,20,21)(H,23,24)/t11-/m1/s1
US Patent
n/an/a<100n/an/an/an/an/an/a
CELGENE QUANTICEL RESEARCH, INC.
US Patent
Assay Description
The ability of test compounds to inhibit the activity of Jarid1B was determined in 384-well plate format under the following reaction conditions: 0.8...
US Patent US9617242 (2017)
BindingDB Entry DOI: 10.7270/Q2XK8HM5