BDBM27778 N-[2-amino-5-(4-fluorophenyl)phenyl]-4-{1,8-diazaspiro[4.5]decan-8-ylmethyl}benzamide::biphenyl diamine analogue, 26
SMILES: Nc1ccc(cc1NC(=O)c1ccc(CN2CCC3(CCCN3)CC2)cc1)-c1ccc(F)cc1
InChI Key: InChIKey=PBXLDWBAQBIJOC-UHFFFAOYSA-N
Data: 2 IC50
Activity Spreadsheet -- Enzyme Inhibition Constant Data from BindingDB
Found 2 hits for monomerid = 27778
Trg + Lig
Ki
nM
ΔG°
kcal/mole
IC50
nM
Kd
nM
EC50/IC50
nM
koff
s-1
kon
M-1s-1
pHTemp
°C
Histone deacetylase 1
(Homo sapiens (Human))
BDBM27778
(N-[2-amino-5-(4-fluorophenyl)phenyl]-4-{1,8-diazas...)
Show SMILES Nc1ccc(cc1NC(=O)c1ccc(CN2CCC3(CCCN3)CC2)cc1)-c1ccc(F)cc1
Show InChI InChI=1S/C28H31FN4O/c29-24-9-6-21(7-10-24)23-8-11-25(30)26(18-23)32-27(34)22-4-2-20(3-5-22)19-33-16-13-28(14-17-33)12-1-15-31-28/h2-11,18,31H,1,12-17,19,30H2,(H,32,34)
NCI pathway
Reactome pathway
n/an/a 13n/an/an/an/a8.037
Merck Research Laboratories
Assay Description
The Fluor-de-Lys HDAC activity assay kit (Biomol) was used. Purified recombinant HDAC enzyme was incubated with Fluor-de-Lys substrate in the presenc...
Bioorg Med Chem Lett 19: 1168-72 (2009)
Article DOI: 10.1016/j.bmcl.2008.12.083
BindingDB Entry DOI: 10.7270/Q2SQ8XQM
Histone deacetylase 3
(Homo sapiens (Human))
BDBM27778
(N-[2-amino-5-(4-fluorophenyl)phenyl]-4-{1,8-diazas...)
Show SMILES Nc1ccc(cc1NC(=O)c1ccc(CN2CCC3(CCCN3)CC2)cc1)-c1ccc(F)cc1
Show InChI InChI=1S/C28H31FN4O/c29-24-9-6-21(7-10-24)23-8-11-25(30)26(18-23)32-27(34)22-4-2-20(3-5-22)19-33-16-13-28(14-17-33)12-1-15-31-28/h2-11,18,31H,1,12-17,19,30H2,(H,32,34)
NCI pathway
Reactome pathway
n/an/a 4.80E+3n/an/an/an/an/a25
Merck Research Laboratories
Assay Description
The Fluor-de-Lys HDAC activity assay kit (Biomol) was used. Purified recombinant HDAC enzyme was incubated with Fluor-de-Lys substrate in the presenc...
Bioorg Med Chem Lett 19: 1168-72 (2009)
Article DOI: 10.1016/j.bmcl.2008.12.083
BindingDB Entry DOI: 10.7270/Q2SQ8XQM