BDBM27784 2-fluoro-6-{[2-({2-methoxy-5-[4-(propan-2-yl)piperazin-1-yl]phenyl}amino)-7H-pyrrolo[2,3-d]pyrimidin-4-yl]amino}benzamide::BMCL19469 Compound 22::pyrrolo[2,3-d]pyrimidine deriv., 2
SMILES: COc1ccc(cc1Nc1nc(Nc2cccc(F)c2C(N)=O)c2cc[nH]c2n1)N1CCN(CC1)C(C)C
InChI Key: InChIKey=FIJVJJGBQDYFNS-UHFFFAOYSA-N
Data: 4 IC50
Activity Spreadsheet -- Enzyme Inhibition Constant Data from BindingDB
Found 4 hits for monomerid = 27784
Trg + Lig
Ki
nM
ΔG°
kcal/mole
IC50
nM
Kd
nM
EC50/IC50
nM
koff
s-1
kon
M-1s-1
pHTemp
°C
Insulin-like growth factor I receptor
(Homo sapiens (Human))
BDBM27784
(2-fluoro-6-{[2-({2-methoxy-5-[4-(propan-2-yl)piper...)
Show SMILES COc1ccc(cc1Nc1nc(Nc2cccc(F)c2C(N)=O)c2cc[nH]c2n1)N1CCN(CC1)C(C)C
Show InChI InChI=1S/C27H31FN8O2/c1-16(2)35-11-13-36(14-12-35)17-7-8-22(38-3)21(15-17)32-27-33-25-18(9-10-30-25)26(34-27)31-20-6-4-5-19(28)23(20)24(29)37/h4-10,15-16H,11-14H2,1-3H3,(H2,29,37)(H3,30,31,32,33,34)
Reactome pathway
n/an/a 4n/an/an/an/a7.522
GSK
Assay Description
Assays are performed in 384-well microtiter plates in reaction buffer containing biotinylated substrate, ATP, and purified activated GST-IGF-1R in th...
Bioorg Med Chem Lett 19: 360-4 (2009)
Article DOI: 10.1016/j.bmcl.2008.11.077
BindingDB Entry DOI: 10.7270/Q2NZ85ZT
Insulin-like growth factor I receptor
(Homo sapiens (Human))
BDBM27784
(2-fluoro-6-{[2-({2-methoxy-5-[4-(propan-2-yl)piper...)
Show SMILES COc1ccc(cc1Nc1nc(Nc2cccc(F)c2C(N)=O)c2cc[nH]c2n1)N1CCN(CC1)C(C)C
Show InChI InChI=1S/C27H31FN8O2/c1-16(2)35-11-13-36(14-12-35)17-7-8-22(38-3)21(15-17)32-27-33-25-18(9-10-30-25)26(34-27)31-20-6-4-5-19(28)23(20)24(29)37/h4-10,15-16H,11-14H2,1-3H3,(H2,29,37)(H3,30,31,32,33,34)
Reactome pathway
n/an/a 4n/an/an/an/a7.522
GSK
Assay Description
Assays are performed in 384-well microtiter plates in reaction buffer containing biotinylated substrate, ATP, and purified activated GST-IGF-1R in th...
Bioorg Med Chem Lett 19: 469-73 (2009)
Article DOI: 10.1016/j.bmcl.2008.11.046
BindingDB Entry DOI: 10.7270/Q2J67F88
Mitogen-activated protein kinase 10
(Homo sapiens (Human))
BDBM27784
(2-fluoro-6-{[2-({2-methoxy-5-[4-(propan-2-yl)piper...)
Show SMILES COc1ccc(cc1Nc1nc(Nc2cccc(F)c2C(N)=O)c2cc[nH]c2n1)N1CCN(CC1)C(C)C
Show InChI InChI=1S/C27H31FN8O2/c1-16(2)35-11-13-36(14-12-35)17-7-8-22(38-3)21(15-17)32-27-33-25-18(9-10-30-25)26(34-27)31-20-6-4-5-19(28)23(20)24(29)37/h4-10,15-16H,11-14H2,1-3H3,(H2,29,37)(H3,30,31,32,33,34)
NCI pathway
Reactome pathway
n/an/a 5.01E+3n/an/an/an/a7.522
GSK
Assay Description
Inhibitor binding to JNK3 was assessed by a fluorescence anisotropy competitive binding assay. The reaction mixture (JNK3 and fluorescently labelled ...
Bioorg Med Chem Lett 19: 360-4 (2009)
Article DOI: 10.1016/j.bmcl.2008.11.077
BindingDB Entry DOI: 10.7270/Q2NZ85ZT
Mitogen-activated protein kinase 8
(Homo sapiens (Human))
BDBM27784
(2-fluoro-6-{[2-({2-methoxy-5-[4-(propan-2-yl)piper...)
Show SMILES COc1ccc(cc1Nc1nc(Nc2cccc(F)c2C(N)=O)c2cc[nH]c2n1)N1CCN(CC1)C(C)C
Show InChI InChI=1S/C27H31FN8O2/c1-16(2)35-11-13-36(14-12-35)17-7-8-22(38-3)21(15-17)32-27-33-25-18(9-10-30-25)26(34-27)31-20-6-4-5-19(28)23(20)24(29)37/h4-10,15-16H,11-14H2,1-3H3,(H2,29,37)(H3,30,31,32,33,34)
NCI pathway
Reactome pathway
n/an/a 3.16E+3n/an/an/an/a7.422
GSK
Assay Description
Assays are performed in 384-well microtiter plates in reaction buffer containing substrate GST-biotin-C-JUN, ATP, and purified activated JNK1alpha1 i...
Bioorg Med Chem Lett 19: 360-4 (2009)
Article DOI: 10.1016/j.bmcl.2008.11.077
BindingDB Entry DOI: 10.7270/Q2NZ85ZT