BDBM27787 2-{[2-({4-chloro-5-[3-(dimethylamino)propoxy]-2-methoxyphenyl}amino)-7H-pyrrolo[2,3-d]pyrimidin-4-yl]amino}-6-fluorobenzamide::pyrrolo[2,3-d]pyrimidine deriv., 5
SMILES: COc1cc(Cl)c(OCCCN(C)C)cc1Nc1nc(Nc2cccc(F)c2C(N)=O)c2cc[nH]c2n1
InChI Key: InChIKey=YDTUAGVDOJNKMO-UHFFFAOYSA-N
Data: 2 IC50
Activity Spreadsheet -- Enzyme Inhibition Constant Data from BindingDB
Found 2 hits for monomerid = 27787
Trg + Lig
Ki
nM
ΔG°
kcal/mole
IC50
nM
Kd
nM
EC50/IC50
nM
koff
s-1
kon
M-1s-1
pHTemp
°C
Mitogen-activated protein kinase 8
(Homo sapiens (Human))
BDBM27787
(2-{[2-({4-chloro-5-[3-(dimethylamino)propoxy]-2-me...)
Show SMILES COc1cc(Cl)c(OCCCN(C)C)cc1Nc1nc(Nc2cccc(F)c2C(N)=O)c2cc[nH]c2n1
Show InChI InChI=1S/C25H27ClFN7O3/c1-34(2)10-5-11-37-19-13-18(20(36-3)12-15(19)26)31-25-32-23-14(8-9-29-23)24(33-25)30-17-7-4-6-16(27)21(17)22(28)35/h4,6-9,12-13H,5,10-11H2,1-3H3,(H2,28,35)(H3,29,30,31,32,33)
NCI pathway
Reactome pathway
n/an/a 1.26E+3n/an/an/an/an/an/a
GSK
Assay Description
Assays are performed in 384-well microtiter plates in reaction buffer containing substrate GST-biotin-C-JUN, ATP, and purified activated JNK1alpha1 i...
Bioorg Med Chem Lett 19: 360-4 (2009)
Article DOI: 10.1016/j.bmcl.2008.11.077
BindingDB Entry DOI: 10.7270/Q2NZ85ZT
Insulin-like growth factor 1 receptor
(Homo sapiens (Human))
BDBM27787
(2-{[2-({4-chloro-5-[3-(dimethylamino)propoxy]-2-me...)
Show SMILES COc1cc(Cl)c(OCCCN(C)C)cc1Nc1nc(Nc2cccc(F)c2C(N)=O)c2cc[nH]c2n1
Show InChI InChI=1S/C25H27ClFN7O3/c1-34(2)10-5-11-37-19-13-18(20(36-3)12-15(19)26)31-25-32-23-14(8-9-29-23)24(33-25)30-17-7-4-6-16(27)21(17)22(28)35/h4,6-9,12-13H,5,10-11H2,1-3H3,(H2,28,35)(H3,29,30,31,32,33)
Reactome pathway
n/an/a 13n/an/an/an/a7.522
GSK
Assay Description
Assays are performed in 384-well microtiter plates in reaction buffer containing biotinylated substrate, ATP, and purified activated GST-IGF-1R in th...
Bioorg Med Chem Lett 19: 360-4 (2009)
Article DOI: 10.1016/j.bmcl.2008.11.077
BindingDB Entry DOI: 10.7270/Q2NZ85ZT