BDBM27792 2-{[2-({5-[2-(dimethylamino)acetamido]-2-methoxyphenyl}amino)-7H-pyrrolo[2,3-d]pyrimidin-4-yl]amino}-6-fluorobenzamide::pyrrolo[2,3-d]pyrimidine deriv., 10
SMILES: COc1ccc(NC(=O)CN(C)C)cc1Nc1nc(Nc2cccc(F)c2C(N)=O)c2cc[nH]c2n1
InChI Key: InChIKey=NACGODPXQGEECG-UHFFFAOYSA-N
Data: 2 IC50
Activity Spreadsheet -- Enzyme Inhibition Constant Data from BindingDB
Found 2 hits for monomerid = 27792
Trg + Lig
Ki
nM
ΔG°
kcal/mole
IC50
nM
Kd
nM
EC50/IC50
nM
koff
s-1
kon
M-1s-1
pHTemp
°C
Mitogen-activated protein kinase 8
(Homo sapiens (Human))
BDBM27792
(2-{[2-({5-[2-(dimethylamino)acetamido]-2-methoxyph...)
Show SMILES COc1ccc(NC(=O)CN(C)C)cc1Nc1nc(Nc2cccc(F)c2C(N)=O)c2cc[nH]c2n1
Show InChI InChI=1S/C24H25FN8O3/c1-33(2)12-19(34)28-13-7-8-18(36-3)17(11-13)30-24-31-22-14(9-10-27-22)23(32-24)29-16-6-4-5-15(25)20(16)21(26)35/h4-11H,12H2,1-3H3,(H2,26,35)(H,28,34)(H3,27,29,30,31,32)
NCI pathway
Reactome pathway
n/an/a 3.16E+3n/an/an/an/an/an/a
GSK
Assay Description
Assays are performed in 384-well microtiter plates in reaction buffer containing substrate GST-biotin-C-JUN, ATP, and purified activated JNK1alpha1 i...
Bioorg Med Chem Lett 19: 360-4 (2009)
Article DOI: 10.1016/j.bmcl.2008.11.077
BindingDB Entry DOI: 10.7270/Q2NZ85ZT
Insulin-like growth factor I receptor
(Homo sapiens (Human))
BDBM27792
(2-{[2-({5-[2-(dimethylamino)acetamido]-2-methoxyph...)
Show SMILES COc1ccc(NC(=O)CN(C)C)cc1Nc1nc(Nc2cccc(F)c2C(N)=O)c2cc[nH]c2n1
Show InChI InChI=1S/C24H25FN8O3/c1-33(2)12-19(34)28-13-7-8-18(36-3)17(11-13)30-24-31-22-14(9-10-27-22)23(32-24)29-16-6-4-5-15(25)20(16)21(26)35/h4-11H,12H2,1-3H3,(H2,26,35)(H,28,34)(H3,27,29,30,31,32)
Reactome pathway
n/an/a 1n/an/an/an/a7.522
GSK
Assay Description
Assays are performed in 384-well microtiter plates in reaction buffer containing biotinylated substrate, ATP, and purified activated GST-IGF-1R in th...
Bioorg Med Chem Lett 19: 360-4 (2009)
Article DOI: 10.1016/j.bmcl.2008.11.077
BindingDB Entry DOI: 10.7270/Q2NZ85ZT