BDBM27797 2-[(2-{[1-(2-aminoacetyl)-5-methoxy-2,3-dihydro-1H-indol-6-yl]amino}-7H-pyrrolo[2,3-d]pyrimidin-4-yl)amino]-6-fluorobenzamide::pyrrolo[2,3-d]pyrimidine deriv., 21
SMILES: COc1cc2CCN(C(=O)CN)c2cc1Nc1nc(Nc2cccc(F)c2C(N)=O)c2cc[nH]c2n1
InChI Key: InChIKey=CDXYAHJJGRNDCW-UHFFFAOYSA-N
Data: 2 IC50
Activity Spreadsheet -- Enzyme Inhibition Constant Data from BindingDB
Found 2 hits for monomerid = 27797
Trg + Lig
Ki
nM
ΔG°
kcal/mole
IC50
nM
Kd
nM
EC50/IC50
nM
koff
s-1
kon
M-1s-1
pHTemp
°C
Mitogen-activated protein kinase 8
(Homo sapiens (Human))
BDBM27797
(2-[(2-{[1-(2-aminoacetyl)-5-methoxy-2,3-dihydro-1H...)
Show SMILES COc1cc2CCN(C(=O)CN)c2cc1Nc1nc(Nc2cccc(F)c2C(N)=O)c2cc[nH]c2n1
Show InChI InChI=1S/C24H23FN8O3/c1-36-18-9-12-6-8-33(19(34)11-26)17(12)10-16(18)30-24-31-22-13(5-7-28-22)23(32-24)29-15-4-2-3-14(25)20(15)21(27)35/h2-5,7,9-10H,6,8,11,26H2,1H3,(H2,27,35)(H3,28,29,30,31,32)
NCI pathway
Reactome pathway
n/an/a 1.00E+3n/an/an/an/an/an/a
GSK
Assay Description
Assays are performed in 384-well microtiter plates in reaction buffer containing substrate GST-biotin-C-JUN, ATP, and purified activated JNK1alpha1 i...
Bioorg Med Chem Lett 19: 360-4 (2009)
Article DOI: 10.1016/j.bmcl.2008.11.077
BindingDB Entry DOI: 10.7270/Q2NZ85ZT
Insulin-like growth factor I receptor
(Homo sapiens (Human))
BDBM27797
(2-[(2-{[1-(2-aminoacetyl)-5-methoxy-2,3-dihydro-1H...)
Show SMILES COc1cc2CCN(C(=O)CN)c2cc1Nc1nc(Nc2cccc(F)c2C(N)=O)c2cc[nH]c2n1
Show InChI InChI=1S/C24H23FN8O3/c1-36-18-9-12-6-8-33(19(34)11-26)17(12)10-16(18)30-24-31-22-13(5-7-28-22)23(32-24)29-15-4-2-3-14(25)20(15)21(27)35/h2-5,7,9-10H,6,8,11,26H2,1H3,(H2,27,35)(H3,28,29,30,31,32)
Reactome pathway
n/an/a 4n/an/an/an/a7.522
GSK
Assay Description
Assays are performed in 384-well microtiter plates in reaction buffer containing biotinylated substrate, ATP, and purified activated GST-IGF-1R in th...
Bioorg Med Chem Lett 19: 360-4 (2009)
Article DOI: 10.1016/j.bmcl.2008.11.077
BindingDB Entry DOI: 10.7270/Q2NZ85ZT