BDBM27798 2-fluoro-6-{[2-({5-methoxy-1-[2-(methylamino)acetyl]-2,3-dihydro-1H-indol-6-yl}amino)-7H-pyrrolo[2,3-d]pyrimidin-4-yl]amino}benzamide::pyrrolo[2,3-d]pyrimidine deriv., 22
SMILES: CNCC(=O)N1CCc2cc(OC)c(Nc3nc(Nc4cccc(F)c4C(N)=O)c4cc[nH]c4n3)cc12
InChI Key: InChIKey=WMNYFCPOALWAPO-UHFFFAOYSA-N
Data: 2 IC50
Activity Spreadsheet -- Enzyme Inhibition Constant Data from BindingDB
Found 2 hits for monomerid = 27798
Trg + Lig
Ki
nM
ΔG°
kcal/mole
IC50
nM
Kd
nM
EC50/IC50
nM
koff
s-1
kon
M-1s-1
pHTemp
°C
Mitogen-activated protein kinase 8
(Homo sapiens (Human))
BDBM27798
(2-fluoro-6-{[2-({5-methoxy-1-[2-(methylamino)acety...)
Show SMILES CNCC(=O)N1CCc2cc(OC)c(Nc3nc(Nc4cccc(F)c4C(N)=O)c4cc[nH]c4n3)cc12
Show InChI InChI=1S/C25H25FN8O3/c1-28-12-20(35)34-9-7-13-10-19(37-2)17(11-18(13)34)31-25-32-23-14(6-8-29-23)24(33-25)30-16-5-3-4-15(26)21(16)22(27)36/h3-6,8,10-11,28H,7,9,12H2,1-2H3,(H2,27,36)(H3,29,30,31,32,33)
NCI pathway
Reactome pathway
n/an/a 2.00E+3n/an/an/an/an/an/a
GSK
Assay Description
Assays are performed in 384-well microtiter plates in reaction buffer containing substrate GST-biotin-C-JUN, ATP, and purified activated JNK1alpha1 i...
Bioorg Med Chem Lett 19: 360-4 (2009)
Article DOI: 10.1016/j.bmcl.2008.11.077
BindingDB Entry DOI: 10.7270/Q2NZ85ZT
Insulin-like growth factor I receptor
(Homo sapiens (Human))
BDBM27798
(2-fluoro-6-{[2-({5-methoxy-1-[2-(methylamino)acety...)
Show SMILES CNCC(=O)N1CCc2cc(OC)c(Nc3nc(Nc4cccc(F)c4C(N)=O)c4cc[nH]c4n3)cc12
Show InChI InChI=1S/C25H25FN8O3/c1-28-12-20(35)34-9-7-13-10-19(37-2)17(11-18(13)34)31-25-32-23-14(6-8-29-23)24(33-25)30-16-5-3-4-15(26)21(16)22(27)36/h3-6,8,10-11,28H,7,9,12H2,1-2H3,(H2,27,36)(H3,29,30,31,32,33)
Reactome pathway
n/an/a 2n/an/an/an/a7.522
GSK
Assay Description
Assays are performed in 384-well microtiter plates in reaction buffer containing biotinylated substrate, ATP, and purified activated GST-IGF-1R in th...
Bioorg Med Chem Lett 19: 360-4 (2009)
Article DOI: 10.1016/j.bmcl.2008.11.077
BindingDB Entry DOI: 10.7270/Q2NZ85ZT