BDBM27802 2-{[2-({1-[2-(diethylamino)acetyl]-5-methoxy-2,3-dihydro-1H-indol-6-yl}amino)-7H-pyrrolo[2,3-d]pyrimidin-4-yl]amino}-6-fluorobenzamide::pyrrolo[2,3-d]pyrimidine deriv., 26
SMILES: CCN(CC)CC(=O)N1CCc2cc(OC)c(Nc3nc(Nc4cccc(F)c4C(N)=O)c4cc[nH]c4n3)cc12
InChI Key: InChIKey=ASLJKKCVGZGUQJ-UHFFFAOYSA-N
Data: 2 IC50
Activity Spreadsheet -- Enzyme Inhibition Constant Data from BindingDB
Found 2 hits for monomerid = 27802
Trg + Lig
Ki
nM
ΔG°
kcal/mole
IC50
nM
Kd
nM
EC50/IC50
nM
koff
s-1
kon
M-1s-1
pHTemp
°C
Mitogen-activated protein kinase 8
(Homo sapiens (Human))
BDBM27802
(2-{[2-({1-[2-(diethylamino)acetyl]-5-methoxy-2,3-d...)
Show SMILES CCN(CC)CC(=O)N1CCc2cc(OC)c(Nc3nc(Nc4cccc(F)c4C(N)=O)c4cc[nH]c4n3)cc12
Show InChI InChI=1S/C28H31FN8O3/c1-4-36(5-2)15-23(38)37-12-10-16-13-22(40-3)20(14-21(16)37)33-28-34-26-17(9-11-31-26)27(35-28)32-19-8-6-7-18(29)24(19)25(30)39/h6-9,11,13-14H,4-5,10,12,15H2,1-3H3,(H2,30,39)(H3,31,32,33,34,35)
NCI pathway
Reactome pathway
n/an/a 1.00E+3n/an/an/an/an/an/a
GSK
Assay Description
Assays are performed in 384-well microtiter plates in reaction buffer containing substrate GST-biotin-C-JUN, ATP, and purified activated JNK1alpha1 i...
Bioorg Med Chem Lett 19: 360-4 (2009)
Article DOI: 10.1016/j.bmcl.2008.11.077
BindingDB Entry DOI: 10.7270/Q2NZ85ZT
Insulin-like growth factor I receptor
(Homo sapiens (Human))
BDBM27802
(2-{[2-({1-[2-(diethylamino)acetyl]-5-methoxy-2,3-d...)
Show SMILES CCN(CC)CC(=O)N1CCc2cc(OC)c(Nc3nc(Nc4cccc(F)c4C(N)=O)c4cc[nH]c4n3)cc12
Show InChI InChI=1S/C28H31FN8O3/c1-4-36(5-2)15-23(38)37-12-10-16-13-22(40-3)20(14-21(16)37)33-28-34-26-17(9-11-31-26)27(35-28)32-19-8-6-7-18(29)24(19)25(30)39/h6-9,11,13-14H,4-5,10,12,15H2,1-3H3,(H2,30,39)(H3,31,32,33,34,35)
Reactome pathway
n/an/a 2n/an/an/an/a7.522
GSK
Assay Description
Assays are performed in 384-well microtiter plates in reaction buffer containing biotinylated substrate, ATP, and purified activated GST-IGF-1R in th...
Bioorg Med Chem Lett 19: 360-4 (2009)
Article DOI: 10.1016/j.bmcl.2008.11.077
BindingDB Entry DOI: 10.7270/Q2NZ85ZT