null
SMILES: CN1CCC(CC1)c1ccc(Nc2ncnc(n2)-c2ccc(O[C@H]3CCN(CC3(F)F)C(C)=O)c(c2)C#N)cc1
InChI Key: InChIKey=RYQFIFAMXTXXOR-SANMLTNESA-N
Activity Spreadsheet -- Enzyme Inhibition Constant Data from BindingDB
Found 6 hits for monomerid = 278080
Trg + Lig
Ki
nM
ΔG°
kcal/mole
IC50
nM
Kd
nM
EC50/IC50
nM
koff
s-1
kon
M-1s-1
pHTemp
°C
Inhibitor of nuclear factor kappa-B kinase subunit epsilon
(Homo sapiens (Human))
BDBM278080
((S)-2-((1-acetyl-3,3-difluoropiperidin-4-yl)oxy)-5...)
Show SMILES CN1CCC(CC1)c1ccc(Nc2ncnc(n2)-c2ccc(O[C@H]3CCN(CC3(F)F)C(C)=O)c(c2)C#N)cc1 |r|
Show InChI InChI=1S/C29H31F2N7O2/c1-19(39)38-14-11-26(29(30,31)17-38)40-25-8-5-22(15-23(25)16-32)27-33-18-34-28(36-27)35-24-6-3-20(4-7-24)21-9-12-37(2)13-10-21/h3-8,15,18,21,26H,9-14,17H2,1-2H3,(H,33,34,35,36)/t26-/m0/s1
Reactome pathway
US Patent
n/an/a<1n/an/an/an/a7.0n/a
Gilead Sciences, Inc.
US Patent
Assay Description
Enzymatic activity of IKKε and TBK1 was measured using a homogeneous time resolved fluorescence resonance energy transfer (TR-FRET) assay that m...
US Patent US10040781 (2018)
BindingDB Entry DOI: 10.7270/Q22V2J41
Inhibitor of nuclear factor kappa-B kinase subunit epsilon
(Homo sapiens (Human))
BDBM278080
((S)-2-((1-acetyl-3,3-difluoropiperidin-4-yl)oxy)-5...)
Show SMILES CN1CCC(CC1)c1ccc(Nc2ncnc(n2)-c2ccc(O[C@H]3CCN(CC3(F)F)C(C)=O)c(c2)C#N)cc1 |r|
Show InChI InChI=1S/C29H31F2N7O2/c1-19(39)38-14-11-26(29(30,31)17-38)40-25-8-5-22(15-23(25)16-32)27-33-18-34-28(36-27)35-24-6-3-20(4-7-24)21-9-12-37(2)13-10-21/h3-8,15,18,21,26H,9-14,17H2,1-2H3,(H,33,34,35,36)/t26-/m0/s1
Reactome pathway
US Patent
n/an/a<1n/an/an/an/an/an/a
University of Rome La Sapienza
Assay Description
Enzymatic activity of IKKε and TBK1 was measured using a homogeneous time resolved fluorescence resonance energy transfer (TR-FRET) assay that m...
J Med Chem 50: 6554-69 (2007)
BindingDB Entry DOI: 10.7270/Q2Q52RXT
Serine/threonine-protein kinase TBK1
(Homo sapiens (Human))
BDBM278080
((S)-2-((1-acetyl-3,3-difluoropiperidin-4-yl)oxy)-5...)
Show SMILES CN1CCC(CC1)c1ccc(Nc2ncnc(n2)-c2ccc(O[C@H]3CCN(CC3(F)F)C(C)=O)c(c2)C#N)cc1 |r|
Show InChI InChI=1S/C29H31F2N7O2/c1-19(39)38-14-11-26(29(30,31)17-38)40-25-8-5-22(15-23(25)16-32)27-33-18-34-28(36-27)35-24-6-3-20(4-7-24)21-9-12-37(2)13-10-21/h3-8,15,18,21,26H,9-14,17H2,1-2H3,(H,33,34,35,36)/t26-/m0/s1
US Patent
n/an/a 2n/an/an/an/an/an/a
University of Rome La Sapienza
Assay Description
Enzymatic activity of IKKε and TBK1 was measured using a homogeneous time resolved fluorescence resonance energy transfer (TR-FRET) assay that m...
J Med Chem 50: 6554-69 (2007)
BindingDB Entry DOI: 10.7270/Q2Q52RXT
Tyrosine-protein kinase JAK2
(Homo sapiens (Human))
BDBM278080
((S)-2-((1-acetyl-3,3-difluoropiperidin-4-yl)oxy)-5...)
Show SMILES CN1CCC(CC1)c1ccc(Nc2ncnc(n2)-c2ccc(O[C@H]3CCN(CC3(F)F)C(C)=O)c(c2)C#N)cc1 |r|
Show InChI InChI=1S/C29H31F2N7O2/c1-19(39)38-14-11-26(29(30,31)17-38)40-25-8-5-22(15-23(25)16-32)27-33-18-34-28(36-27)35-24-6-3-20(4-7-24)21-9-12-37(2)13-10-21/h3-8,15,18,21,26H,9-14,17H2,1-2H3,(H,33,34,35,36)/t26-/m0/s1
Reactome pathway
US Patent
n/an/a 174n/an/an/an/an/an/a
University of Rome La Sapienza
Assay Description
Enzymatic activity of hJAK2 was measured using a LANCE homogeneous time resolved fluorescence resonance energy transfer (TR-FRET) assay that monitors...
J Med Chem 50: 6554-69 (2007)
BindingDB Entry DOI: 10.7270/Q2Q52RXT
Serine/threonine-protein kinase TBK1
(Homo sapiens (Human))
BDBM278080
((S)-2-((1-acetyl-3,3-difluoropiperidin-4-yl)oxy)-5...)
Show SMILES CN1CCC(CC1)c1ccc(Nc2ncnc(n2)-c2ccc(O[C@H]3CCN(CC3(F)F)C(C)=O)c(c2)C#N)cc1 |r|
Show InChI InChI=1S/C29H31F2N7O2/c1-19(39)38-14-11-26(29(30,31)17-38)40-25-8-5-22(15-23(25)16-32)27-33-18-34-28(36-27)35-24-6-3-20(4-7-24)21-9-12-37(2)13-10-21/h3-8,15,18,21,26H,9-14,17H2,1-2H3,(H,33,34,35,36)/t26-/m0/s1
US Patent
n/an/a 2.00E+3n/an/an/an/a7.0n/a
Gilead Sciences, Inc.
US Patent
Assay Description
Enzymatic activity of IKKε and TBK1 was measured using a homogeneous time resolved fluorescence resonance energy transfer (TR-FRET) assay that m...
US Patent US10040781 (2018)
BindingDB Entry DOI: 10.7270/Q22V2J41
Tyrosine-protein kinase JAK2
(Homo sapiens (Human))
BDBM278080
((S)-2-((1-acetyl-3,3-difluoropiperidin-4-yl)oxy)-5...)
Show SMILES CN1CCC(CC1)c1ccc(Nc2ncnc(n2)-c2ccc(O[C@H]3CCN(CC3(F)F)C(C)=O)c(c2)C#N)cc1 |r|
Show InChI InChI=1S/C29H31F2N7O2/c1-19(39)38-14-11-26(29(30,31)17-38)40-25-8-5-22(15-23(25)16-32)27-33-18-34-28(36-27)35-24-6-3-20(4-7-24)21-9-12-37(2)13-10-21/h3-8,15,18,21,26H,9-14,17H2,1-2H3,(H,33,34,35,36)/t26-/m0/s1
Reactome pathway
US Patent
n/an/a 1.74E+5n/an/an/an/a7.5n/a
Gilead Sciences, Inc.
US Patent
Assay Description
Enzymatic activity of hJAK2 was measured using a LANCE homogeneous time resolved fluorescence resonance energy transfer (TR-FRET) assay that monitors...
US Patent US10040781 (2018)
BindingDB Entry DOI: 10.7270/Q22V2J41