BDBM278103 2-(((3R,4S)-3-fluoro-1-(2-hydroxyacetyl)piperidin-4-yl)oxy)-5-(4-((3-methoxy-4-(4-morpholinopiperidin-1-yl)phenyl)amino)-1,3,5-triazin-2-yl)benzonitrile::US10040781, Example 325::US10253019, Example 325
SMILES: COc1cc(Nc2ncnc(n2)-c2ccc(O[C@H]3CCN(C[C@H]3F)C(=O)CO)c(c2)C#N)ccc1N1CCC(CC1)N1CCOCC1
InChI Key: InChIKey=NRBCTDSKRRXYFZ-UHSQPCAPSA-N
Data: 6 IC50
Activity Spreadsheet -- Enzyme Inhibition Constant Data from BindingDB
Found 6 hits for monomerid = 278103
Trg + Lig
Ki
nM
ΔG°
kcal/mole
IC50
nM
Kd
nM
EC50/IC50
nM
koff
s-1
kon
M-1s-1
pHTemp
°C
Protein cereblon/Serine/threonine-protein kinase TBK1
(Homo sapiens (Human))
BDBM278103
(2-(((3R,4S)-3-fluoro-1-(2-hydroxyacetyl)piperidin-...)
Show SMILES COc1cc(Nc2ncnc(n2)-c2ccc(O[C@H]3CCN(C[C@H]3F)C(=O)CO)c(c2)C#N)ccc1N1CCC(CC1)N1CCOCC1 |r|
Show InChI InChI=1S/C33H39FN8O5/c1-45-30-17-24(3-4-27(30)41-9-6-25(7-10-41)40-12-14-46-15-13-40)38-33-37-21-36-32(39-33)22-2-5-28(23(16-22)18-35)47-29-8-11-42(19-26(29)34)31(44)20-43/h2-5,16-17,21,25-26,29,43H,6-15,19-20H2,1H3,(H,36,37,38,39)/t26-,29+/m1/s1
US Patent
n/an/a 2.00E+3n/an/an/an/a7.0n/a
Gilead Sciences, Inc.
US Patent
Assay Description
Enzymatic activity of IKKε and TBK1 was measured using a homogeneous time resolved fluorescence resonance energy transfer (TR-FRET) assay that m...
US Patent US10040781 (2018)
BindingDB Entry DOI: 10.7270/Q22V2J41
Inhibitor of nuclear factor kappa-B kinase subunit epsilon
(Homo sapiens (Human))
BDBM278103
(2-(((3R,4S)-3-fluoro-1-(2-hydroxyacetyl)piperidin-...)
Show SMILES COc1cc(Nc2ncnc(n2)-c2ccc(O[C@H]3CCN(C[C@H]3F)C(=O)CO)c(c2)C#N)ccc1N1CCC(CC1)N1CCOCC1 |r|
Show InChI InChI=1S/C33H39FN8O5/c1-45-30-17-24(3-4-27(30)41-9-6-25(7-10-41)40-12-14-46-15-13-40)38-33-37-21-36-32(39-33)22-2-5-28(23(16-22)18-35)47-29-8-11-42(19-26(29)34)31(44)20-43/h2-5,16-17,21,25-26,29,43H,6-15,19-20H2,1H3,(H,36,37,38,39)/t26-,29+/m1/s1
Reactome pathway
US Patent
n/an/a<1n/an/an/an/a7.0n/a
Gilead Sciences, Inc.
US Patent
Assay Description
Enzymatic activity of IKKε and TBK1 was measured using a homogeneous time resolved fluorescence resonance energy transfer (TR-FRET) assay that m...
US Patent US10040781 (2018)
BindingDB Entry DOI: 10.7270/Q22V2J41
Tyrosine-protein kinase JAK2
(Homo sapiens (Human))
BDBM278103
(2-(((3R,4S)-3-fluoro-1-(2-hydroxyacetyl)piperidin-...)
Show SMILES COc1cc(Nc2ncnc(n2)-c2ccc(O[C@H]3CCN(C[C@H]3F)C(=O)CO)c(c2)C#N)ccc1N1CCC(CC1)N1CCOCC1 |r|
Show InChI InChI=1S/C33H39FN8O5/c1-45-30-17-24(3-4-27(30)41-9-6-25(7-10-41)40-12-14-46-15-13-40)38-33-37-21-36-32(39-33)22-2-5-28(23(16-22)18-35)47-29-8-11-42(19-26(29)34)31(44)20-43/h2-5,16-17,21,25-26,29,43H,6-15,19-20H2,1H3,(H,36,37,38,39)/t26-,29+/m1/s1
Reactome pathway
US Patent
n/an/a 28n/an/an/an/an/an/a
University of Rome La Sapienza
Assay Description
Enzymatic activity of hJAK2 was measured using a LANCE homogeneous time resolved fluorescence resonance energy transfer (TR-FRET) assay that monitors...
J Med Chem 50: 6554-69 (2007)
BindingDB Entry DOI: 10.7270/Q2Q52RXT
Protein cereblon/Serine/threonine-protein kinase TBK1
(Homo sapiens (Human))
BDBM278103
(2-(((3R,4S)-3-fluoro-1-(2-hydroxyacetyl)piperidin-...)
Show SMILES COc1cc(Nc2ncnc(n2)-c2ccc(O[C@H]3CCN(C[C@H]3F)C(=O)CO)c(c2)C#N)ccc1N1CCC(CC1)N1CCOCC1 |r|
Show InChI InChI=1S/C33H39FN8O5/c1-45-30-17-24(3-4-27(30)41-9-6-25(7-10-41)40-12-14-46-15-13-40)38-33-37-21-36-32(39-33)22-2-5-28(23(16-22)18-35)47-29-8-11-42(19-26(29)34)31(44)20-43/h2-5,16-17,21,25-26,29,43H,6-15,19-20H2,1H3,(H,36,37,38,39)/t26-,29+/m1/s1
US Patent
n/an/a 2n/an/an/an/an/an/a
University of Rome La Sapienza
Assay Description
Enzymatic activity of IKKε and TBK1 was measured using a homogeneous time resolved fluorescence resonance energy transfer (TR-FRET) assay that m...
J Med Chem 50: 6554-69 (2007)
BindingDB Entry DOI: 10.7270/Q2Q52RXT
Inhibitor of nuclear factor kappa-B kinase subunit epsilon
(Homo sapiens (Human))
BDBM278103
(2-(((3R,4S)-3-fluoro-1-(2-hydroxyacetyl)piperidin-...)
Show SMILES COc1cc(Nc2ncnc(n2)-c2ccc(O[C@H]3CCN(C[C@H]3F)C(=O)CO)c(c2)C#N)ccc1N1CCC(CC1)N1CCOCC1 |r|
Show InChI InChI=1S/C33H39FN8O5/c1-45-30-17-24(3-4-27(30)41-9-6-25(7-10-41)40-12-14-46-15-13-40)38-33-37-21-36-32(39-33)22-2-5-28(23(16-22)18-35)47-29-8-11-42(19-26(29)34)31(44)20-43/h2-5,16-17,21,25-26,29,43H,6-15,19-20H2,1H3,(H,36,37,38,39)/t26-,29+/m1/s1
Reactome pathway
US Patent
n/an/a<1n/an/an/an/an/an/a
University of Rome La Sapienza
Assay Description
Enzymatic activity of IKKε and TBK1 was measured using a homogeneous time resolved fluorescence resonance energy transfer (TR-FRET) assay that m...
J Med Chem 50: 6554-69 (2007)
BindingDB Entry DOI: 10.7270/Q2Q52RXT
Tyrosine-protein kinase JAK2
(Homo sapiens (Human))
BDBM278103
(2-(((3R,4S)-3-fluoro-1-(2-hydroxyacetyl)piperidin-...)
Show SMILES COc1cc(Nc2ncnc(n2)-c2ccc(O[C@H]3CCN(C[C@H]3F)C(=O)CO)c(c2)C#N)ccc1N1CCC(CC1)N1CCOCC1 |r|
Show InChI InChI=1S/C33H39FN8O5/c1-45-30-17-24(3-4-27(30)41-9-6-25(7-10-41)40-12-14-46-15-13-40)38-33-37-21-36-32(39-33)22-2-5-28(23(16-22)18-35)47-29-8-11-42(19-26(29)34)31(44)20-43/h2-5,16-17,21,25-26,29,43H,6-15,19-20H2,1H3,(H,36,37,38,39)/t26-,29+/m1/s1
Reactome pathway
US Patent
n/an/a 2.80E+4n/an/an/an/a7.5n/a
Gilead Sciences, Inc.
US Patent
Assay Description
Enzymatic activity of hJAK2 was measured using a LANCE homogeneous time resolved fluorescence resonance energy transfer (TR-FRET) assay that monitors...
US Patent US10040781 (2018)
BindingDB Entry DOI: 10.7270/Q22V2J41