BDBM27819 2-[(2-{[4-(1-propyl-1,2,5,6-tetrahydropyridin-3-yl)phenyl]amino}-7H-pyrrolo[2,3-d]pyrimidin-4-yl)amino]benzamide::4,6-bis-anilino-1H-pyrrolo[2,3-d]pyrimidine, 2
SMILES: CCCN1CCC=C(C1)c1ccc(Nc2nc(Nc3ccccc3C(N)=O)c3cc[nH]c3n2)cc1
InChI Key: InChIKey=USFRNJSCBVCBFY-UHFFFAOYSA-N
Data: 1 IC50
Activity Spreadsheet -- Enzyme Inhibition Constant Data from BindingDB
Found 1 hit for monomerid = 27819
Trg + Lig
Ki
nM
ΔG°
kcal/mole
IC50
nM
Kd
nM
EC50/IC50
nM
koff
s-1
kon
M-1s-1
pHTemp
°C
Insulin-like growth factor I receptor
(Homo sapiens (Human))
BDBM27819
(2-[(2-{[4-(1-propyl-1,2,5,6-tetrahydropyridin-3-yl...)
Show SMILES CCCN1CCC=C(C1)c1ccc(Nc2nc(Nc3ccccc3C(N)=O)c3cc[nH]c3n2)cc1 |c:6|
Show InChI InChI=1S/C27H29N7O/c1-2-15-34-16-5-6-19(17-34)18-9-11-20(12-10-18)30-27-32-25-22(13-14-29-25)26(33-27)31-23-8-4-3-7-21(23)24(28)35/h3-4,6-14H,2,5,15-17H2,1H3,(H2,28,35)(H3,29,30,31,32,33)
Reactome pathway
n/an/a 1.60n/an/an/an/a7.522
GSK
Assay Description
Assays are performed in 384-well microtiter plates in reaction buffer containing biotinylated substrate, ATP, and purified activated GST-IGF-1R in th...
Bioorg Med Chem Lett 19: 469-73 (2009)
Article DOI: 10.1016/j.bmcl.2008.11.046
BindingDB Entry DOI: 10.7270/Q2J67F88