BDBM27824 4,6-bis-anilino-1H-pyrrolo[2,3-d]pyrimidine, 7::4-fluoro-2-[(2-{[2-(propan-2-yloxy)-4-(1-propyl-1,2,5,6-tetrahydropyridin-3-yl)phenyl]amino}-7H-pyrrolo[2,3-d]pyrimidin-4-yl)amino]benzamide
SMILES: CCCN1CCC=C(C1)c1ccc(Nc2nc(Nc3cc(F)ccc3C(N)=O)c3cc[nH]c3n2)c(OC(C)C)c1
InChI Key: InChIKey=LLJQAOJWAQJFPC-UHFFFAOYSA-N
Data: 1 IC50
Activity Spreadsheet -- Enzyme Inhibition Constant Data from BindingDB
Found 1 hit for monomerid = 27824
Trg + Lig
Ki
nM
ΔG°
kcal/mole
IC50
nM
Kd
nM
EC50/IC50
nM
koff
s-1
kon
M-1s-1
pHTemp
°C
Insulin-like growth factor I receptor
(Homo sapiens (Human))
BDBM27824
(4,6-bis-anilino-1H-pyrrolo[2,3-d]pyrimidine, 7 | 4...)
Show SMILES CCCN1CCC=C(C1)c1ccc(Nc2nc(Nc3cc(F)ccc3C(N)=O)c3cc[nH]c3n2)c(OC(C)C)c1 |c:6|
Show InChI InChI=1S/C30H34FN7O2/c1-4-13-38-14-5-6-20(17-38)19-7-10-24(26(15-19)40-18(2)3)35-30-36-28-23(11-12-33-28)29(37-30)34-25-16-21(31)8-9-22(25)27(32)39/h6-12,15-16,18H,4-5,13-14,17H2,1-3H3,(H2,32,39)(H3,33,34,35,36,37)
Reactome pathway
n/an/a 3.20n/an/an/an/a7.522
GSK
Assay Description
Assays are performed in 384-well microtiter plates in reaction buffer containing biotinylated substrate, ATP, and purified activated GST-IGF-1R in th...
Bioorg Med Chem Lett 19: 469-73 (2009)
Article DOI: 10.1016/j.bmcl.2008.11.046
BindingDB Entry DOI: 10.7270/Q2J67F88