BDBM27850 N-[(4-fluorophenyl)methyl]-3-hydroxy-4-oxo-4H-pyran-2-carboxamide::hydroxypyrone amide, 2a
SMILES: Oc1c(occc1=O)C(=O)NCc1ccc(F)cc1
InChI Key: InChIKey=OQNRHJYFNWARIC-UHFFFAOYSA-N
Data: 1 IC50
Activity Spreadsheet -- Enzyme Inhibition Constant Data from BindingDB
Found 1 hit for monomerid = 27850
Trg + Lig
Ki
nM
ΔG°
kcal/mole
IC50
nM
Kd
nM
EC50/IC50
nM
koff
s-1
kon
M-1s-1
pHTemp
°C
Anthrax Lethal Factor (LF)
(Bacillus anthracis)
BDBM27850
(N-[(4-fluorophenyl)methyl]-3-hydroxy-4-oxo-4H-pyra...)
Show SMILES Oc1c(occc1=O)C(=O)NCc1ccc(F)cc1
Show InChI InChI=1S/C13H10FNO4/c14-9-3-1-8(2-4-9)7-15-13(18)12-11(17)10(16)5-6-19-12/h1-6,17H,7H2,(H,15,18)
NCI pathway
Reactome pathway
n/an/a>1.00E+5n/an/an/an/a7.025
Howard Hughes Medical Institute
Assay Description
Fluorescence peptide cleavage assay was performed in a 96-well plate. Each reaction contained fluorogenic peptide substrate, LF, and small-molecule i...
J Med Chem 52: 1063-74 (2009)
Article DOI: 10.1021/jm8013212
BindingDB Entry DOI: 10.7270/Q2DJ5CZV