BDBM27873 3-hydroxy-N-[(2-methoxyphenyl)methyl]-4-sulfanylidene-4H-pyran-2-carbothioamide::hydroxypyrothione thioamide, 5c
SMILES: COc1ccccc1CNC(=S)c1occc(=S)c1O
InChI Key: InChIKey=TXXHMCNJVWPWDL-UHFFFAOYSA-N
Data: 1 IC50
Activity Spreadsheet -- Enzyme Inhibition Constant Data from BindingDB
Found 1 hit for monomerid = 27873
Trg + Lig
Ki
nM
ΔG°
kcal/mole
IC50
nM
Kd
nM
EC50/IC50
nM
koff
s-1
kon
M-1s-1
pHTemp
°C
Anthrax Lethal Factor (LF)
(Bacillus anthracis)
BDBM27873
(3-hydroxy-N-[(2-methoxyphenyl)methyl]-4-sulfanylid...)
Show SMILES COc1ccccc1CNC(=S)c1occc(=S)c1O
Show InChI InChI=1S/C14H13NO3S2/c1-17-10-5-3-2-4-9(10)8-15-14(20)13-12(16)11(19)6-7-18-13/h2-7,16H,8H2,1H3,(H,15,20)
NCI pathway
Reactome pathway
n/an/a 8.70E+3n/an/an/an/a7.025
Howard Hughes Medical Institute
Assay Description
Fluorescence peptide cleavage assay was performed in a 96-well plate. Each reaction contained fluorogenic peptide substrate, LF, and small-molecule i...
J Med Chem 52: 1063-74 (2009)
Article DOI: 10.1021/jm8013212
BindingDB Entry DOI: 10.7270/Q2DJ5CZV