BDBM278851 2-{[(1R,2S)-2- aminocyclohexyl] amino}-N-(3-bromo-1- methyl-1H-pyrazol- 4-yl)thieno[2,3-b] pyrazine-7- carboxamide trifluoroacetate::US10040802, Example 30
SMILES: OC(=O)C(F)(F)F.Cn1cc(NC(=O)c2csc3ncc(N[C@@H]4CCCC[C@@H]4N)nc23)c(Br)n1
InChI Key: InChIKey=UVLDKDDPWHRKLM-VZXYPILPSA-N
Data: 1 IC50
Activity Spreadsheet -- Enzyme Inhibition Constant Data from BindingDB
Found 1 hit for monomerid = 278851
Trg + Lig
Ki
nM
ΔG°
kcal/mole
IC50
nM
Kd
nM
EC50/IC50
nM
koff
s-1
kon
M-1s-1
pHTemp
°C
Interleukin-1 receptor-associated kinase 4
(Homo sapiens (Human))
BDBM278851
(2-{[(1R,2S)-2- aminocyclohexyl] amino}-N-(3-bromo-...)
Show SMILES OC(=O)C(F)(F)F.Cn1cc(NC(=O)c2csc3ncc(N[C@@H]4CCCC[C@@H]4N)nc23)c(Br)n1 |r|
Show InChI InChI=1S/C17H20BrN7OS.C2HF3O2/c1-25-7-12(15(18)24-25)22-16(26)9-8-27-17-14(9)23-13(6-20-17)21-11-5-3-2-4-10(11)19;3-2(4,5)1(6)7/h6-8,10-11H,2-5,19H2,1H3,(H,21,23)(H,22,26);(H,6,7)/t10-,11+;/m0./s1
Reactome pathway
US Patent
n/an/a 0.600n/an/an/an/a7.2n/a
Merck Sharp & Dohme Corp.
US Patent
Assay Description
The kinase activity of IRAK4 is determined by its ability to catalyze the phosphorylation of a fluorescent polypeptide substrate. The extent of phosp...
US Patent US10040802 (2018)
BindingDB Entry DOI: 10.7270/Q298891C