BDBM279022 5-(2-ethoxy-3-pyridyl)-1-isopropyl-3-methyl-N-[(5-methyl-1,2,4-oxadiazol-3-yl)methyl]pyrazolo[4,3-b]pyridin-7-amine::US10034861, Example 52::US10512632, Example 52::US10766893, Example S52::US10806718, Example 52
SMILES: CCOc1ncccc1-c1cc(NCc2noc(C)n2)c2n(nc(C)c2n1)C(C)C
InChI Key: InChIKey=GALBTAGDVOLYTK-UHFFFAOYSA-N
Data: 15 IC50
Activity Spreadsheet -- Enzyme Inhibition Constant Data from BindingDB
Found 15 hits for monomerid = 279022
Trg + Lig
Ki
nM
ΔG°
kcal/mole
IC50
nM
Kd
nM
EC50/IC50
nM
koff
s-1
kon
M-1s-1
pHTemp
°C
Calcium/calmodulin-dependent 3',5'-cyclic nucleotide phosphodiesterase 1A
(Homo sapiens (Human))
BDBM279022
(5-(2-ethoxy-3-pyridyl)-1-isopropyl-3-methyl-N-[(5-...)
Show SMILES CCOc1ncccc1-c1cc(NCc2noc(C)n2)c2n(nc(C)c2n1)C(C)C
Show InChI InChI=1S/C21H25N7O2/c1-6-29-21-15(8-7-9-22-21)16-10-17(23-11-18-24-14(5)30-27-18)20-19(25-16)13(4)26-28(20)12(2)3/h7-10,12H,6,11H2,1-5H3,(H,23,25)
US Patent
n/an/a 1.90n/an/an/an/a7.625
H. Lundbeck A/S
US Patent
Assay Description
PDE1A, PDE1B and PDE1C assays were performed as follows: the assays was performed in 60 μL samples containing a fixed amount of the PDE1 enzyme ...
US Patent US10034861 (2018)
BindingDB Entry DOI: 10.7270/Q2X350HN
Calcium/calmodulin-dependent 3',5'-cyclic nucleotide phosphodiesterase 1C
(Homo sapiens (Human))
BDBM279022
(5-(2-ethoxy-3-pyridyl)-1-isopropyl-3-methyl-N-[(5-...)
Show SMILES CCOc1ncccc1-c1cc(NCc2noc(C)n2)c2n(nc(C)c2n1)C(C)C
Show InChI InChI=1S/C21H25N7O2/c1-6-29-21-15(8-7-9-22-21)16-10-17(23-11-18-24-14(5)30-27-18)20-19(25-16)13(4)26-28(20)12(2)3/h7-10,12H,6,11H2,1-5H3,(H,23,25)
US Patent
n/an/a 4.40n/an/an/an/an/an/a
H. Lundbeck A/S
US Patent
Assay Description
PDE1A, PDE1B and PDE1C assays were performed as follows: the assays was performed in 60 uL samples containing a fixed amount of the PDE1 enzyme (suff...
US Patent US11026923 (2021)
Calcium/calmodulin-dependent 3',5'-cyclic nucleotide phosphodiesterase 1C
(Homo sapiens (Human))
BDBM279022
(5-(2-ethoxy-3-pyridyl)-1-isopropyl-3-methyl-N-[(5-...)
Show SMILES CCOc1ncccc1-c1cc(NCc2noc(C)n2)c2n(nc(C)c2n1)C(C)C
Show InChI InChI=1S/C21H25N7O2/c1-6-29-21-15(8-7-9-22-21)16-10-17(23-11-18-24-14(5)30-27-18)20-19(25-16)13(4)26-28(20)12(2)3/h7-10,12H,6,11H2,1-5H3,(H,23,25)
US Patent
n/an/a 4.40n/an/an/an/a7.625
H. Lundbeck A/S
US Patent
Assay Description
PDE1A, PDE1B and PDE1C assays were performed as follows: the assays was performed in 60 μL samples containing a fixed amount of the PDE1 enzyme ...
US Patent US10034861 (2018)
BindingDB Entry DOI: 10.7270/Q2X350HN
Calcium/calmodulin-dependent 3',5'-cyclic phosphodiesterase 1A
(Homo sapiens (Human))
BDBM279022
(5-(2-ethoxy-3-pyridyl)-1-isopropyl-3-methyl-N-[(5-...)
Show SMILES CCOc1ncccc1-c1cc(NCc2noc(C)n2)c2n(nc(C)c2n1)C(C)C
Show InChI InChI=1S/C21H25N7O2/c1-6-29-21-15(8-7-9-22-21)16-10-17(23-11-18-24-14(5)30-27-18)20-19(25-16)13(4)26-28(20)12(2)3/h7-10,12H,6,11H2,1-5H3,(H,23,25)
US Patent
n/an/a 1.90n/an/an/an/an/an/a
H. Lundbeck A/S
US Patent
Assay Description
PDE1A, PDE1B and PDE1C assays were performed as follows: the assays was performed in 60 μL samples containing a fixed amount of the PDE1 enzyme ...
US Patent US10512632 (2019)
BindingDB Entry DOI: 10.7270/Q25T3NVN
Calcium/calmodulin-dependent 3',5'-cyclic nucleotide phosphodiesterase 1B
(Homo sapiens (Human))
BDBM279022
(5-(2-ethoxy-3-pyridyl)-1-isopropyl-3-methyl-N-[(5-...)
Show SMILES CCOc1ncccc1-c1cc(NCc2noc(C)n2)c2n(nc(C)c2n1)C(C)C
Show InChI InChI=1S/C21H25N7O2/c1-6-29-21-15(8-7-9-22-21)16-10-17(23-11-18-24-14(5)30-27-18)20-19(25-16)13(4)26-28(20)12(2)3/h7-10,12H,6,11H2,1-5H3,(H,23,25)
Reactome pathway
US Patent
n/an/a 0.170n/an/an/an/an/an/a
H. Lundbeck A/S
US Patent
Assay Description
PDE1A, PDE1B and PDE1C assays were performed as follows: the assays was performed in 60 μL samples containing a fixed amount of the PDE1 enzyme ...
US Patent US10512632 (2019)
BindingDB Entry DOI: 10.7270/Q25T3NVN
Calcium/calmodulin-dependent 3',5'-cyclic nucleotide phosphodiesterase 1C
(Homo sapiens (Human))
BDBM279022
(5-(2-ethoxy-3-pyridyl)-1-isopropyl-3-methyl-N-[(5-...)
Show SMILES CCOc1ncccc1-c1cc(NCc2noc(C)n2)c2n(nc(C)c2n1)C(C)C
Show InChI InChI=1S/C21H25N7O2/c1-6-29-21-15(8-7-9-22-21)16-10-17(23-11-18-24-14(5)30-27-18)20-19(25-16)13(4)26-28(20)12(2)3/h7-10,12H,6,11H2,1-5H3,(H,23,25)
US Patent
n/an/a 4.40n/an/an/an/an/an/a
H. Lundbeck A/S
US Patent
Assay Description
PDE1A, PDE1B and PDE1C assays were performed as follows: the assays was performed in 60 μL samples containing a fixed amount of the PDE1 enzyme ...
US Patent US10512632 (2019)
BindingDB Entry DOI: 10.7270/Q25T3NVN
Calcium/calmodulin-dependent 3',5'-cyclic phosphodiesterase 1A
(Homo sapiens (Human))
BDBM279022
(5-(2-ethoxy-3-pyridyl)-1-isopropyl-3-methyl-N-[(5-...)
Show SMILES CCOc1ncccc1-c1cc(NCc2noc(C)n2)c2n(nc(C)c2n1)C(C)C
Show InChI InChI=1S/C21H25N7O2/c1-6-29-21-15(8-7-9-22-21)16-10-17(23-11-18-24-14(5)30-27-18)20-19(25-16)13(4)26-28(20)12(2)3/h7-10,12H,6,11H2,1-5H3,(H,23,25)
US Patent
n/an/a 1.90n/an/an/an/an/an/a
H. Lundbeck A/S
US Patent
Assay Description
PDE1A, PDE1B and PDE1C assays were performed as follows: the assays were performed in 60 μL samples containing a fixed amount of the PDE1 enzyme...
US Patent US10766893 (2020)
Calcium/calmodulin-dependent 3',5'-cyclic nucleotide phosphodiesterase 1B
(Homo sapiens (Human))
BDBM279022
(5-(2-ethoxy-3-pyridyl)-1-isopropyl-3-methyl-N-[(5-...)
Show SMILES CCOc1ncccc1-c1cc(NCc2noc(C)n2)c2n(nc(C)c2n1)C(C)C
Show InChI InChI=1S/C21H25N7O2/c1-6-29-21-15(8-7-9-22-21)16-10-17(23-11-18-24-14(5)30-27-18)20-19(25-16)13(4)26-28(20)12(2)3/h7-10,12H,6,11H2,1-5H3,(H,23,25)
Reactome pathway
US Patent
n/an/a 0.170n/an/an/an/an/an/a
H. Lundbeck A/S
US Patent
Assay Description
PDE1A, PDE1B and PDE1C assays were performed as follows: the assays were performed in 60 μL samples containing a fixed amount of the PDE1 enzyme...
US Patent US10766893 (2020)
Calcium/calmodulin-dependent 3',5'-cyclic nucleotide phosphodiesterase 1C
(Homo sapiens (Human))
BDBM279022
(5-(2-ethoxy-3-pyridyl)-1-isopropyl-3-methyl-N-[(5-...)
Show SMILES CCOc1ncccc1-c1cc(NCc2noc(C)n2)c2n(nc(C)c2n1)C(C)C
Show InChI InChI=1S/C21H25N7O2/c1-6-29-21-15(8-7-9-22-21)16-10-17(23-11-18-24-14(5)30-27-18)20-19(25-16)13(4)26-28(20)12(2)3/h7-10,12H,6,11H2,1-5H3,(H,23,25)
US Patent
n/an/a 4.40n/an/an/an/an/an/a
H. Lundbeck A/S
US Patent
Assay Description
PDE1A, PDE1B and PDE1C assays were performed as follows: the assays were performed in 60 μL samples containing a fixed amount of the PDE1 enzyme...
US Patent US10766893 (2020)
Calcium/calmodulin-dependent 3',5'-cyclic phosphodiesterase 1A
(Homo sapiens (Human))
BDBM279022
(5-(2-ethoxy-3-pyridyl)-1-isopropyl-3-methyl-N-[(5-...)
Show SMILES CCOc1ncccc1-c1cc(NCc2noc(C)n2)c2n(nc(C)c2n1)C(C)C
Show InChI InChI=1S/C21H25N7O2/c1-6-29-21-15(8-7-9-22-21)16-10-17(23-11-18-24-14(5)30-27-18)20-19(25-16)13(4)26-28(20)12(2)3/h7-10,12H,6,11H2,1-5H3,(H,23,25)
US Patent
n/an/a 1.90n/an/an/an/an/an/a
H. Lundbeck A/S
US Patent
Assay Description
PDE1A, PDE1B and PDE1C assays were performed as follows: the assays was performed in 60 μL samples containing a fixed amount of the PDE1 enzyme ...
US Patent US10806718 (2020)
Calcium/calmodulin-dependent 3',5'-cyclic nucleotide phosphodiesterase 1B
(Homo sapiens (Human))
BDBM279022
(5-(2-ethoxy-3-pyridyl)-1-isopropyl-3-methyl-N-[(5-...)
Show SMILES CCOc1ncccc1-c1cc(NCc2noc(C)n2)c2n(nc(C)c2n1)C(C)C
Show InChI InChI=1S/C21H25N7O2/c1-6-29-21-15(8-7-9-22-21)16-10-17(23-11-18-24-14(5)30-27-18)20-19(25-16)13(4)26-28(20)12(2)3/h7-10,12H,6,11H2,1-5H3,(H,23,25)
Reactome pathway
US Patent
n/an/a 0.170n/an/an/an/an/an/a
H. Lundbeck A/S
US Patent
Assay Description
PDE1A, PDE1B and PDE1C assays were performed as follows: the assays was performed in 60 μL samples containing a fixed amount of the PDE1 enzyme ...
US Patent US10806718 (2020)
Calcium/calmodulin-dependent 3',5'-cyclic nucleotide phosphodiesterase 1C
(Homo sapiens (Human))
BDBM279022
(5-(2-ethoxy-3-pyridyl)-1-isopropyl-3-methyl-N-[(5-...)
Show SMILES CCOc1ncccc1-c1cc(NCc2noc(C)n2)c2n(nc(C)c2n1)C(C)C
Show InChI InChI=1S/C21H25N7O2/c1-6-29-21-15(8-7-9-22-21)16-10-17(23-11-18-24-14(5)30-27-18)20-19(25-16)13(4)26-28(20)12(2)3/h7-10,12H,6,11H2,1-5H3,(H,23,25)
US Patent
n/an/a 4.40n/an/an/an/an/an/a
H. Lundbeck A/S
US Patent
Assay Description
PDE1A, PDE1B and PDE1C assays were performed as follows: the assays was performed in 60 μL samples containing a fixed amount of the PDE1 enzyme ...
US Patent US10806718 (2020)
Calcium/calmodulin-dependent 3',5'-cyclic phosphodiesterase 1A
(Homo sapiens (Human))
BDBM279022
(5-(2-ethoxy-3-pyridyl)-1-isopropyl-3-methyl-N-[(5-...)
Show SMILES CCOc1ncccc1-c1cc(NCc2noc(C)n2)c2n(nc(C)c2n1)C(C)C
Show InChI InChI=1S/C21H25N7O2/c1-6-29-21-15(8-7-9-22-21)16-10-17(23-11-18-24-14(5)30-27-18)20-19(25-16)13(4)26-28(20)12(2)3/h7-10,12H,6,11H2,1-5H3,(H,23,25)
US Patent
n/an/a 1.90n/an/an/an/an/an/a
H. Lundbeck A/S
US Patent
Assay Description
PDE1A, PDE1B and PDE1C assays were performed as follows: the assays was performed in 60 uL samples containing a fixed amount of the PDE1 enzyme (suff...
US Patent US11026923 (2021)
Calcium/calmodulin-dependent 3',5'-cyclic nucleotide phosphodiesterase 1B
(Homo sapiens (Human))
BDBM279022
(5-(2-ethoxy-3-pyridyl)-1-isopropyl-3-methyl-N-[(5-...)
Show SMILES CCOc1ncccc1-c1cc(NCc2noc(C)n2)c2n(nc(C)c2n1)C(C)C
Show InChI InChI=1S/C21H25N7O2/c1-6-29-21-15(8-7-9-22-21)16-10-17(23-11-18-24-14(5)30-27-18)20-19(25-16)13(4)26-28(20)12(2)3/h7-10,12H,6,11H2,1-5H3,(H,23,25)
Reactome pathway
US Patent
n/an/a 0.170n/an/an/an/an/an/a
H. Lundbeck A/S
US Patent
Assay Description
PDE1A, PDE1B and PDE1C assays were performed as follows: the assays was performed in 60 uL samples containing a fixed amount of the PDE1 enzyme (suff...
US Patent US11026923 (2021)
Phosphodiesterase, PDE1/PDE5
(Homo sapiens (Human))
BDBM279022
(5-(2-ethoxy-3-pyridyl)-1-isopropyl-3-methyl-N-[(5-...)
Show SMILES CCOc1ncccc1-c1cc(NCc2noc(C)n2)c2n(nc(C)c2n1)C(C)C
Show InChI InChI=1S/C21H25N7O2/c1-6-29-21-15(8-7-9-22-21)16-10-17(23-11-18-24-14(5)30-27-18)20-19(25-16)13(4)26-28(20)12(2)3/h7-10,12H,6,11H2,1-5H3,(H,23,25)
Reactome pathway
US Patent
n/an/a 0.170n/an/an/an/a7.625
H. Lundbeck A/S
US Patent
Assay Description
PDE1A, PDE1B and PDE1C assays were performed as follows: the assays was performed in 60 μL samples containing a fixed amount of the PDE1 enzyme ...
US Patent US10034861 (2018)
BindingDB Entry DOI: 10.7270/Q2X350HN